{"text_format":"1","workbook":"xlsx","n_sheets":15,"sheets":["SP1_Sprint","SP2_Sprint","SP3","SP4","SP5_Sprint","SP6","SP7","SP8_Sprint","Export_SP1","Export_SP2","Export_SP3","Export_SP4","Export_SP5","Export_SP8","Export_SP6"],"not_rendered":{"charts":0,"images":0,"macros":1,"external_links":0,"defined_names":3,"comments":0,"pivot_tables":0},"unopened":[],"bounds":{"document_bytes":16777216,"sheet_cells":100000,"rows_first":2000,"rows_last":500,"rows_between":2000,"halvings":0,"cell_chars":16384,"cell_head_chars":4096},"cells_cut":0,"cells_raw":0,"read":"whole","date_system":"1900"}

{"sheet":"SP1_Sprint","index":0,"n_rows":104,"n_cols":17,"rows_kept":104,"cut":false,"hidden":false,"merged":[]}
[null,null,null,"#","Fahrtzeit","Abweichung","00:00:07","Diff.",null,null,null,null,null,null,"bitte auf das Vorzeichen \"-\" achten!","m:ss,00"]
[1," Christian","Jäger",1,"00:00:07,51","00:00:00.00",{"$f":"IF(E2=\"Keine Zeit\",\"\",E2)","v":"00:00:07,51"},{"$f":"ABS(G2-$G$1)","v":"00:00:00.510"},{"$f":"IF(G2<=$G$1,\"-\",\"\")","v":""},"Fahrer"," ","mit der StartNr. ",",hat erfolgreich die Prüfung SP1 absolviert. Zeit:",{"$f":"J2&B2&K2&C2&K2&L2&A2&K2&M2","v":"Fahrer Christian Jäger mit der StartNr. 1 ,hat erfolgreich die Prüfung SP1 absolviert. Zeit:"},{"$f":"IF(ISERROR(H2),\"\",J2&B2&K2&C2&K2&L2&A2&K2&M2&K2&K2&K2&I2)","v":"Fahrer Christian Jäger mit der StartNr. 1 ,hat erfolgreich die Prüfung SP1 absolviert. Zeit:   "},{"$f":"IF(ISERROR(H2),\"\",H2)","v":"00:00:00.510"},{"$f":"IF(P2=\"\",\"\",1)","v":1}]
[2," Daniel","Rinck",2,"00:00:07,51","00:00:00.00",{"$f":"IF(E3=\"Keine Zeit\",\"\",E3)","v":"00:00:07,51"},{"$f":"ABS(G3-$G$1)","v":"00:00:00.510"},{"$f":"IF(G3<=$G$1,\"-\",\"\")","v":""},"Fahrer"," ","mit der StartNr. ",",hat erfolgreich die Prüfung SP1 absolviert. Zeit:",{"$f":"J3&B3&K3&C3&K3&L3&A3&K3&M3","v":"Fahrer Daniel Rinck mit der StartNr. 2 ,hat erfolgreich die Prüfung SP1 absolviert. Zeit:"},{"$f":"IF(ISERROR(H3),\"\",J3&B3&K3&C3&K3&L3&A3&K3&M3&K3&K3&K3&I3)","v":"Fahrer Daniel Rinck mit der StartNr. 2 ,hat erfolgreich die Prüfung SP1 absolviert. Zeit:   "},{"$f":"IF(ISERROR(H3),\"\",H3)","v":"00:00:00.510"},{"$f":"IF(P3=\"\",\"\",1)","v":1}]
[3," Malte","Proff-Klein",3,"00:00:08,31","00:00:01.31","00:00:08,31","00:00:01.310","","Fahrer"," ","mit der StartNr. ",",hat erfolgreich die Prüfung SP1 absolviert. Zeit:","Fahrer Malte Proff-Klein mit der StartNr. 3 ,hat erfolgreich die Prüfung SP1 absolviert. Zeit:","Fahrer Malte Proff-Klein mit der StartNr. 3 ,hat erfolgreich die Prüfung SP1 absolviert. Zeit:   ","00:00:01.310",1]
[4," Dietmar","Siemssen",4,"00:00:07,45","00:00:01.31","00:00:07,45","00:00:00.450","","Fahrer"," ","mit der StartNr. ",",hat erfolgreich die Prüfung SP1 absolviert. Zeit:","Fahrer Dietmar Siemssen mit der StartNr. 4 ,hat erfolgreich die Prüfung SP1 absolviert. Zeit:","Fahrer Dietmar Siemssen mit der StartNr. 4 ,hat erfolgreich die Prüfung SP1 absolviert. Zeit:   ","00:00:00.450",1]
[5," Franz-Michael","Hartmann",5,"00:00:11,97","00:00:05.03","00:00:11,97","00:00:04.970","","Fahrer"," ","mit der StartNr. ",",hat erfolgreich die Prüfung SP1 absolviert. Zeit:","Fahrer Franz-Michael Hartmann mit der StartNr. 5 ,hat erfolgreich die Prüfung SP1 absolviert. Zeit:","Fahrer Franz-Michael Hartmann mit der StartNr. 5 ,hat erfolgreich die Prüfung SP1 absolviert. Zeit:   ","00:00:04.970",1]
[6," Christoph","Schroer",6,"00:00:07,77","00:00:05.03","00:00:07,77","00:00:00.770","","Fahrer"," ","mit der StartNr. ",",hat erfolgreich die Prüfung SP1 absolviert. Zeit:","Fahrer Christoph Schroer mit der StartNr. 6 ,hat erfolgreich die Prüfung SP1 absolviert. Zeit:","Fahrer Christoph Schroer mit der StartNr. 6 ,hat erfolgreich die Prüfung SP1 absolviert. Zeit:   ","00:00:00.770",1]
[7," Jochen","Artzinger-Bolten",7,"00:00:09,02","00:00:02.02","00:00:09,02","00:00:02.020","","Fahrer"," ","mit der StartNr. ",",hat erfolgreich die Prüfung SP1 absolviert. Zeit:","Fahrer Jochen Artzinger-Bolten mit der StartNr. 7 ,hat erfolgreich die Prüfung SP1 absolviert. Zeit:","Fahrer Jochen Artzinger-Bolten mit der StartNr. 7 ,hat erfolgreich die Prüfung SP1 absolviert. Zeit:   ","00:00:02.020",1]
[8," Friedhelm","Eickhorn",8,"00:00:09,41","00:00:02.41","00:00:09,41","00:00:02.410","","Fahrer"," ","mit der StartNr. ",",hat erfolgreich die Prüfung SP1 absolviert. Zeit:","Fahrer Friedhelm Eickhorn mit der StartNr. 8 ,hat erfolgreich die Prüfung SP1 absolviert. Zeit:","Fahrer Friedhelm Eickhorn mit der StartNr. 8 ,hat erfolgreich die Prüfung SP1 absolviert. Zeit:   ","00:00:02.410",1]
[9," Carsten","Reblin",9,"00:00:08,84","00:00:01.84","00:00:08,84","00:00:01.840","","Fahrer"," ","mit der StartNr. ",",hat erfolgreich die Prüfung SP1 absolviert. Zeit:","Fahrer Carsten Reblin mit der StartNr. 9 ,hat erfolgreich die Prüfung SP1 absolviert. Zeit:","Fahrer Carsten Reblin mit der StartNr. 9 ,hat erfolgreich die Prüfung SP1 absolviert. Zeit:   ","00:00:01.840",1]
[10," Dieter","Dinges",10,"00:00:08,51","00:00:01.51","00:00:08,51","00:00:01.510","","Fahrer"," ","mit der StartNr. ",",hat erfolgreich die Prüfung SP1 absolviert. Zeit:","Fahrer Dieter Dinges mit der StartNr. 10 ,hat erfolgreich die Prüfung SP1 absolviert. Zeit:","Fahrer Dieter Dinges mit der StartNr. 10 ,hat erfolgreich die Prüfung SP1 absolviert. Zeit:   ","00:00:01.510",1]
[11," Wolfgang","Reeh",11,"00:00:09,83","00:00:02.83","00:00:09,83","00:00:02.830","","Fahrer"," ","mit der StartNr. ",",hat erfolgreich die Prüfung SP1 absolviert. Zeit:","Fahrer Wolfgang Reeh mit der StartNr. 11 ,hat erfolgreich die Prüfung SP1 absolviert. Zeit:","Fahrer Wolfgang Reeh mit der StartNr. 11 ,hat erfolgreich die Prüfung SP1 absolviert. Zeit:   ","00:00:02.830",1]
[12," Andreas","Petry",12,"00:00:07,79","00:00:02.83","00:00:07,79","00:00:00.790","","Fahrer"," ","mit der StartNr. ",",hat erfolgreich die Prüfung SP1 absolviert. Zeit:","Fahrer Andreas Petry mit der StartNr. 12 ,hat erfolgreich die Prüfung SP1 absolviert. Zeit:","Fahrer Andreas Petry mit der StartNr. 12 ,hat erfolgreich die Prüfung SP1 absolviert. Zeit:   ","00:00:00.790",1]
[13," Ted","Prenzel",13,"00:00:08,35","00:00:01.35","00:00:08,35","00:00:01.350","","Fahrer"," ","mit der StartNr. ",",hat erfolgreich die Prüfung SP1 absolviert. Zeit:","Fahrer Ted Prenzel mit der StartNr. 13 ,hat erfolgreich die Prüfung SP1 absolviert. Zeit:","Fahrer Ted Prenzel mit der StartNr. 13 ,hat erfolgreich die Prüfung SP1 absolviert. Zeit:   ","00:00:01.350",1]
[14," Micha","Barsties",14,"00:00:06,13","00:00:00.87","00:00:06,13","00:00:00.870","","Fahrer"," ","mit der StartNr. ",",hat erfolgreich die Prüfung SP1 absolviert. Zeit:","Fahrer Micha Barsties mit der StartNr. 14 ,hat erfolgreich die Prüfung SP1 absolviert. Zeit:","Fahrer Micha Barsties mit der StartNr. 14 ,hat erfolgreich die Prüfung SP1 absolviert. Zeit:   ","00:00:00.870",1]
[15," Klaus","Flettner",15,"00:00:08,11","00:00:01.11","00:00:08,11","00:00:01.110","","Fahrer"," ","mit der StartNr. ",",hat erfolgreich die Prüfung SP1 absolviert. Zeit:","Fahrer Klaus Flettner mit der StartNr. 15 ,hat erfolgreich die Prüfung SP1 absolviert. Zeit:","Fahrer Klaus Flettner mit der StartNr. 15 ,hat erfolgreich die Prüfung SP1 absolviert. Zeit:   ","00:00:01.110",1]
[16," Heinz","Frey",16,"00:00:07,58","00:00:01.11","00:00:07,58","00:00:00.580","","Fahrer"," ","mit der StartNr. ",",hat erfolgreich die Prüfung SP1 absolviert. Zeit:","Fahrer Heinz Frey mit der StartNr. 16 ,hat erfolgreich die Prüfung SP1 absolviert. Zeit:","Fahrer Heinz Frey mit der StartNr. 16 ,hat erfolgreich die Prüfung SP1 absolviert. Zeit:   ","00:00:00.580",1]
[17," Henning","Reichel",17,"00:00:08,49","00:00:01.49","00:00:08,49","00:00:01.490","","Fahrer"," ","mit der StartNr. ",",hat erfolgreich die Prüfung SP1 absolviert. Zeit:","Fahrer Henning Reichel mit der StartNr. 17 ,hat erfolgreich die Prüfung SP1 absolviert. Zeit:","Fahrer Henning Reichel mit der StartNr. 17 ,hat erfolgreich die Prüfung SP1 absolviert. Zeit:   ","00:00:01.490",1]
[18," Maik","Käbisch",18,"00:00:07,29","00:00:01.49","00:00:07,29","00:00:00.290","","Fahrer"," ","mit der StartNr. ",",hat erfolgreich die Prüfung SP1 absolviert. Zeit:","Fahrer Maik Käbisch mit der StartNr. 18 ,hat erfolgreich die Prüfung SP1 absolviert. Zeit:","Fahrer Maik Käbisch mit der StartNr. 18 ,hat erfolgreich die Prüfung SP1 absolviert. Zeit:   ","00:00:00.290",1]
[19," Harald","Zapp",19,"00:00:07,61","00:00:01.49","00:00:07,61","00:00:00.610","","Fahrer"," ","mit der StartNr. ",",hat erfolgreich die Prüfung SP1 absolviert. Zeit:","Fahrer Harald Zapp mit der StartNr. 19 ,hat erfolgreich die Prüfung SP1 absolviert. Zeit:","Fahrer Harald Zapp mit der StartNr. 19 ,hat erfolgreich die Prüfung SP1 absolviert. Zeit:   ","00:00:00.610",1]
[20," Reinhard","Grzesik",20,"00:00:08,88","00:00:01.88","00:00:08,88","00:00:01.880","","Fahrer"," ","mit der StartNr. ",",hat erfolgreich die Prüfung SP1 absolviert. Zeit:","Fahrer Reinhard Grzesik mit der StartNr. 20 ,hat erfolgreich die Prüfung SP1 absolviert. Zeit:","Fahrer Reinhard Grzesik mit der StartNr. 20 ,hat erfolgreich die Prüfung SP1 absolviert. Zeit:   ","00:00:01.880",1]
[21," Jörg","Sihler",21,"00:00:08,00","00:00:01.00","00:00:08,00","00:00:01","","Fahrer"," ","mit der StartNr. ",",hat erfolgreich die Prüfung SP1 absolviert. Zeit:","Fahrer Jörg Sihler mit der StartNr. 21 ,hat erfolgreich die Prüfung SP1 absolviert. Zeit:","Fahrer Jörg Sihler mit der StartNr. 21 ,hat erfolgreich die Prüfung SP1 absolviert. Zeit:   ","00:00:01",1]
[22," Ingo","Winterstein",22,"00:00:08,56","00:00:01.56","00:00:08,56","00:00:01.560","","Fahrer"," ","mit der StartNr. ",",hat erfolgreich die Prüfung SP1 absolviert. Zeit:","Fahrer Ingo Winterstein mit der StartNr. 22 ,hat erfolgreich die Prüfung SP1 absolviert. Zeit:","Fahrer Ingo Winterstein mit der StartNr. 22 ,hat erfolgreich die Prüfung SP1 absolviert. Zeit:   ","00:00:01.560",1]
[23," Hans Werner","Melchior",23,"00:00:06,88","00:00:00.12","00:00:06,88","00:00:00.120","","Fahrer"," ","mit der StartNr. ",",hat erfolgreich die Prüfung SP1 absolviert. Zeit:","Fahrer Hans Werner Melchior mit der StartNr. 23 ,hat erfolgreich die Prüfung SP1 absolviert. Zeit:","Fahrer Hans Werner Melchior mit der StartNr. 23 ,hat erfolgreich die Prüfung SP1 absolviert. Zeit:   ","00:00:00.120",1]
[24," Marco","Oriolo",24,"00:00:06,56","00:00:00.44","00:00:06,56","00:00:00.440","","Fahrer"," ","mit der StartNr. ",",hat erfolgreich die Prüfung SP1 absolviert. Zeit:","Fahrer Marco Oriolo mit der StartNr. 24 ,hat erfolgreich die Prüfung SP1 absolviert. Zeit:","Fahrer Marco Oriolo mit der StartNr. 24 ,hat erfolgreich die Prüfung SP1 absolviert. Zeit:   ","00:00:00.440",1]
[25," Manfred","Stommel",25,"00:00:10,79","00:00:05.21","00:00:10,79","00:00:03.790","","Fahrer"," ","mit der StartNr. ",",hat erfolgreich die Prüfung SP1 absolviert. Zeit:","Fahrer Manfred Stommel mit der StartNr. 25 ,hat erfolgreich die Prüfung SP1 absolviert. Zeit:","Fahrer Manfred Stommel mit der StartNr. 25 ,hat erfolgreich die Prüfung SP1 absolviert. Zeit:   ","00:00:03.790",1]
[26," Carolin","Heusel",26,"00:00:07,38","00:00:05.21","00:00:07,38","00:00:00.380","","Fahrer"," ","mit der StartNr. ",",hat erfolgreich die Prüfung SP1 absolviert. Zeit:","Fahrer Carolin Heusel mit der StartNr. 26 ,hat erfolgreich die Prüfung SP1 absolviert. Zeit:","Fahrer Carolin Heusel mit der StartNr. 26 ,hat erfolgreich die Prüfung SP1 absolviert. Zeit:   ","00:00:00.380",1]
[27," Regina","Philippi",27,"00:00:09,54","00:00:02.54","00:00:09,54","00:00:02.540","","Fahrer"," ","mit der StartNr. ",",hat erfolgreich die Prüfung SP1 absolviert. Zeit:","Fahrer Regina Philippi mit der StartNr. 27 ,hat erfolgreich die Prüfung SP1 absolviert. Zeit:","Fahrer Regina Philippi mit der StartNr. 27 ,hat erfolgreich die Prüfung SP1 absolviert. Zeit:   ","00:00:02.540",1]
[28," Christof","Aha",28,"00:00:09,32","00:00:02.32","00:00:09,32","00:00:02.320","","Fahrer"," ","mit der StartNr. ",",hat erfolgreich die Prüfung SP1 absolviert. Zeit:","Fahrer Christof Aha mit der StartNr. 28 ,hat erfolgreich die Prüfung SP1 absolviert. Zeit:","Fahrer Christof Aha mit der StartNr. 28 ,hat erfolgreich die Prüfung SP1 absolviert. Zeit:   ","00:00:02.320",1]
[29," Dennis","Weiss",29,"00:00:08,89","00:00:01.89","00:00:08,89","00:00:01.890","","Fahrer"," ","mit der StartNr. ",",hat erfolgreich die Prüfung SP1 absolviert. Zeit:","Fahrer Dennis Weiss mit der StartNr. 29 ,hat erfolgreich die Prüfung SP1 absolviert. Zeit:","Fahrer Dennis Weiss mit der StartNr. 29 ,hat erfolgreich die Prüfung SP1 absolviert. Zeit:   ","00:00:01.890",1]
[30," Harald","Hamprecht",30,"00:00:07,26","00:00:01.89","00:00:07,26","00:00:00.260","","Fahrer"," ","mit der StartNr. ",",hat erfolgreich die Prüfung SP1 absolviert. Zeit:","Fahrer Harald Hamprecht mit der StartNr. 30 ,hat erfolgreich die Prüfung SP1 absolviert. Zeit:","Fahrer Harald Hamprecht mit der StartNr. 30 ,hat erfolgreich die Prüfung SP1 absolviert. Zeit:   ","00:00:00.260",1]
[31," Reno","Fiolic",31,"00:00:09,61","00:00:02.61","00:00:09,61","00:00:02.610","","Fahrer"," ","mit der StartNr. ",",hat erfolgreich die Prüfung SP1 absolviert. Zeit:","Fahrer Reno Fiolic mit der StartNr. 31 ,hat erfolgreich die Prüfung SP1 absolviert. Zeit:","Fahrer Reno Fiolic mit der StartNr. 31 ,hat erfolgreich die Prüfung SP1 absolviert. Zeit:   ","00:00:02.610",1]
[32," Jürgen","Kulpe",32,"00:00:10,66","00:00:05.34","00:00:10,66","00:00:03.660","","Fahrer"," ","mit der StartNr. ",",hat erfolgreich die Prüfung SP1 absolviert. Zeit:","Fahrer Jürgen Kulpe mit der StartNr. 32 ,hat erfolgreich die Prüfung SP1 absolviert. Zeit:","Fahrer Jürgen Kulpe mit der StartNr. 32 ,hat erfolgreich die Prüfung SP1 absolviert. Zeit:   ","00:00:03.660",1]
[33," Konstantin","Kovarbasic",33,"00:00:13,66","00:00:05.34","00:00:13,66","00:00:06.660","","Fahrer"," ","mit der StartNr. ",",hat erfolgreich die Prüfung SP1 absolviert. Zeit:","Fahrer Konstantin Kovarbasic mit der StartNr. 33 ,hat erfolgreich die Prüfung SP1 absolviert. Zeit:","Fahrer Konstantin Kovarbasic mit der StartNr. 33 ,hat erfolgreich die Prüfung SP1 absolviert. Zeit:   ","00:00:06.660",1]
[34," Nikolaus","Kratz",34,"00:00:07,76","00:00:05.34","00:00:07,76","00:00:00.760","","Fahrer"," ","mit der StartNr. ",",hat erfolgreich die Prüfung SP1 absolviert. Zeit:","Fahrer Nikolaus Kratz mit der StartNr. 34 ,hat erfolgreich die Prüfung SP1 absolviert. Zeit:","Fahrer Nikolaus Kratz mit der StartNr. 34 ,hat erfolgreich die Prüfung SP1 absolviert. Zeit:   ","00:00:00.760",1]
[35," Andreas","Eberhardt",35,"00:00:07,80","00:00:05.34","00:00:07,80","00:00:00.800","","Fahrer"," ","mit der StartNr. ",",hat erfolgreich die Prüfung SP1 absolviert. Zeit:","Fahrer Andreas Eberhardt mit der StartNr. 35 ,hat erfolgreich die Prüfung SP1 absolviert. Zeit:","Fahrer Andreas Eberhardt mit der StartNr. 35 ,hat erfolgreich die Prüfung SP1 absolviert. Zeit:   ","00:00:00.800",1]
[36," Gerhard","Thomas",36,"00:00:06,07","00:00:00.93","00:00:06,07","00:00:00.930","","Fahrer"," ","mit der StartNr. ",",hat erfolgreich die Prüfung SP1 absolviert. Zeit:","Fahrer Gerhard Thomas mit der StartNr. 36 ,hat erfolgreich die Prüfung SP1 absolviert. Zeit:","Fahrer Gerhard Thomas mit der StartNr. 36 ,hat erfolgreich die Prüfung SP1 absolviert. Zeit:   ","00:00:00.930",1]
[37," Lotzi","Kende",37,"00:00:07,51","00:00:00.93","00:00:07,51","00:00:00.510","","Fahrer"," ","mit der StartNr. ",",hat erfolgreich die Prüfung SP1 absolviert. Zeit:","Fahrer Lotzi Kende mit der StartNr. 37 ,hat erfolgreich die Prüfung SP1 absolviert. Zeit:","Fahrer Lotzi Kende mit der StartNr. 37 ,hat erfolgreich die Prüfung SP1 absolviert. Zeit:   ","00:00:00.510",1]
[38," Jockel","Winkelhock",38,"00:00:10,45","00:00:05.55","00:00:10,45","00:00:03.450","","Fahrer"," ","mit der StartNr. ",",hat erfolgreich die Prüfung SP1 absolviert. Zeit:","Fahrer Jockel Winkelhock mit der StartNr. 38 ,hat erfolgreich die Prüfung SP1 absolviert. Zeit:","Fahrer Jockel Winkelhock mit der StartNr. 38 ,hat erfolgreich die Prüfung SP1 absolviert. Zeit:   ","00:00:03.450",1]
[39," Sascha","Wilkesmann",39,"00:00:09,17","00:00:02.17","00:00:09,17","00:00:02.170","","Fahrer"," ","mit der StartNr. ",",hat erfolgreich die Prüfung SP1 absolviert. Zeit:","Fahrer Sascha Wilkesmann mit der StartNr. 39 ,hat erfolgreich die Prüfung SP1 absolviert. Zeit:","Fahrer Sascha Wilkesmann mit der StartNr. 39 ,hat erfolgreich die Prüfung SP1 absolviert. Zeit:   ","00:00:02.170",1]
[40," Gregor","Schulz",40,"00:00:09,35","00:00:02.35","00:00:09,35","00:00:02.350","","Fahrer"," ","mit der StartNr. ",",hat erfolgreich die Prüfung SP1 absolviert. Zeit:","Fahrer Gregor Schulz mit der StartNr. 40 ,hat erfolgreich die Prüfung SP1 absolviert. Zeit:","Fahrer Gregor Schulz mit der StartNr. 40 ,hat erfolgreich die Prüfung SP1 absolviert. Zeit:   ","00:00:02.350",1]
[41," Peer","Hildmann",41,"00:00:07,20","00:00:02.35","00:00:07,20","00:00:00.200","","Fahrer"," ","mit der StartNr. ",",hat erfolgreich die Prüfung SP1 absolviert. Zeit:","Fahrer Peer Hildmann mit der StartNr. 41 ,hat erfolgreich die Prüfung SP1 absolviert. Zeit:","Fahrer Peer Hildmann mit der StartNr. 41 ,hat erfolgreich die Prüfung SP1 absolviert. Zeit:   ","00:00:00.200",1]
[42," Mina","Tander",42,"00:00:11,57","00:00:05.43","00:00:11,57","00:00:04.570","","Fahrer"," ","mit der StartNr. ",",hat erfolgreich die Prüfung SP1 absolviert. Zeit:","Fahrer Mina Tander mit der StartNr. 42 ,hat erfolgreich die Prüfung SP1 absolviert. Zeit:","Fahrer Mina Tander mit der StartNr. 42 ,hat erfolgreich die Prüfung SP1 absolviert. Zeit:   ","00:00:04.570",1]
[43," Stefan","Iskan",43,"00:00:08,42","00:00:01.42","00:00:08,42","00:00:01.420","","Fahrer"," ","mit der StartNr. ",",hat erfolgreich die Prüfung SP1 absolviert. Zeit:","Fahrer Stefan Iskan mit der StartNr. 43 ,hat erfolgreich die Prüfung SP1 absolviert. Zeit:","Fahrer Stefan Iskan mit der StartNr. 43 ,hat erfolgreich die Prüfung SP1 absolviert. Zeit:   ","00:00:01.420",1]
[44," Jean-Philippe","Kempf",44,"00:00:08,28","00:00:01.28","00:00:08,28","00:00:01.280","","Fahrer"," ","mit der StartNr. ",",hat erfolgreich die Prüfung SP1 absolviert. Zeit:","Fahrer Jean-Philippe Kempf mit der StartNr. 44 ,hat erfolgreich die Prüfung SP1 absolviert. Zeit:","Fahrer Jean-Philippe Kempf mit der StartNr. 44 ,hat erfolgreich die Prüfung SP1 absolviert. Zeit:   ","00:00:01.280",1]
[45," Daniel","Martin",45,"00:00:07,35","00:00:01.28","00:00:07,35","00:00:00.350","","Fahrer"," ","mit der StartNr. ",",hat erfolgreich die Prüfung SP1 absolviert. Zeit:","Fahrer Daniel Martin mit der StartNr. 45 ,hat erfolgreich die Prüfung SP1 absolviert. Zeit:","Fahrer Daniel Martin mit der StartNr. 45 ,hat erfolgreich die Prüfung SP1 absolviert. Zeit:   ","00:00:00.350",1]
[46," Elena","Funk",46,"00:00:08,35","00:00:01.35","00:00:08,35","00:00:01.350","","Fahrer"," ","mit der StartNr. ",",hat erfolgreich die Prüfung SP1 absolviert. Zeit:","Fahrer Elena Funk mit der StartNr. 46 ,hat erfolgreich die Prüfung SP1 absolviert. Zeit:","Fahrer Elena Funk mit der StartNr. 46 ,hat erfolgreich die Prüfung SP1 absolviert. Zeit:   ","00:00:01.350",1]
[47," Hans","Mutschall",47,"00:00:07,58","00:00:01.35","00:00:07,58","00:00:00.580","","Fahrer"," ","mit der StartNr. ",",hat erfolgreich die Prüfung SP1 absolviert. Zeit:","Fahrer Hans Mutschall mit der StartNr. 47 ,hat erfolgreich die Prüfung SP1 absolviert. Zeit:","Fahrer Hans Mutschall mit der StartNr. 47 ,hat erfolgreich die Prüfung SP1 absolviert. Zeit:   ","00:00:00.580",1]
[48," Kahled","Rahman",48,"00:00:08,65","00:00:01.65","00:00:08,65","00:00:01.650","","Fahrer"," ","mit der StartNr. ",",hat erfolgreich die Prüfung SP1 absolviert. Zeit:","Fahrer Kahled Rahman mit der StartNr. 48 ,hat erfolgreich die Prüfung SP1 absolviert. Zeit:","Fahrer Kahled Rahman mit der StartNr. 48 ,hat erfolgreich die Prüfung SP1 absolviert. Zeit:   ","00:00:01.650",1]
[49," Jochen","Schwarz",49,"00:00:07,13","00:00:01.65","00:00:07,13","00:00:00.130","","Fahrer"," ","mit der StartNr. ",",hat erfolgreich die Prüfung SP1 absolviert. Zeit:","Fahrer Jochen Schwarz mit der StartNr. 49 ,hat erfolgreich die Prüfung SP1 absolviert. Zeit:","Fahrer Jochen Schwarz mit der StartNr. 49 ,hat erfolgreich die Prüfung SP1 absolviert. Zeit:   ","00:00:00.130",1]
[50," Axel","Nawrath",50,"Keine Zeit","———","",{"$error":"#VALUE!"},"","Fahrer"," ","mit der StartNr. ",",hat erfolgreich die Prüfung SP1 absolviert. Zeit:","Fahrer Axel Nawrath mit der StartNr. 50 ,hat erfolgreich die Prüfung SP1 absolviert. Zeit:","","",""]
[51," Birgit","Claussen",51,"00:00:08,27","00:00:01.27","00:00:08,27","00:00:01.270","","Fahrer"," ","mit der StartNr. ",",hat erfolgreich die Prüfung SP1 absolviert. Zeit:","Fahrer Birgit Claussen mit der StartNr. 51 ,hat erfolgreich die Prüfung SP1 absolviert. Zeit:","Fahrer Birgit Claussen mit der StartNr. 51 ,hat erfolgreich die Prüfung SP1 absolviert. Zeit:   ","00:00:01.270",1]
[52," Harald","König",52,"00:00:08,08","00:00:01.08","00:00:08,08","00:00:01.080","","Fahrer"," ","mit der StartNr. ",",hat erfolgreich die Prüfung SP1 absolviert. Zeit:","Fahrer Harald König mit der StartNr. 52 ,hat erfolgreich die Prüfung SP1 absolviert. Zeit:","Fahrer Harald König mit der StartNr. 52 ,hat erfolgreich die Prüfung SP1 absolviert. Zeit:   ","00:00:01.080",1]
[53," Thomas","Blank",53,"00:00:07,19","00:00:01.08","00:00:07,19","00:00:00.190","","Fahrer"," ","mit der StartNr. ",",hat erfolgreich die Prüfung SP1 absolviert. Zeit:","Fahrer Thomas Blank mit der StartNr. 53 ,hat erfolgreich die Prüfung SP1 absolviert. Zeit:","Fahrer Thomas Blank mit der StartNr. 53 ,hat erfolgreich die Prüfung SP1 absolviert. Zeit:   ","00:00:00.190",1]
[54," Heidi","Eberhardt",54,"00:00:08,14","00:00:01.14","00:00:08,14","00:00:01.140","","Fahrer"," ","mit der StartNr. ",",hat erfolgreich die Prüfung SP1 absolviert. Zeit:","Fahrer Heidi Eberhardt mit der StartNr. 54 ,hat erfolgreich die Prüfung SP1 absolviert. Zeit:","Fahrer Heidi Eberhardt mit der StartNr. 54 ,hat erfolgreich die Prüfung SP1 absolviert. Zeit:   ","00:00:01.140",1]
[55," Karina","Ansos",55,"00:00:06,72","00:00:00.28","00:00:06,72","00:00:00.280","","Fahrer"," ","mit der StartNr. ",",hat erfolgreich die Prüfung SP1 absolviert. Zeit:","Fahrer Karina Ansos mit der StartNr. 55 ,hat erfolgreich die Prüfung SP1 absolviert. Zeit:","Fahrer Karina Ansos mit der StartNr. 55 ,hat erfolgreich die Prüfung SP1 absolviert. Zeit:   ","00:00:00.280",1]
[56," Michael","Gotta",56,"00:00:08,35","00:00:01.35","00:00:08,35","00:00:01.350","","Fahrer"," ","mit der StartNr. ",",hat erfolgreich die Prüfung SP1 absolviert. Zeit:","Fahrer Michael Gotta mit der StartNr. 56 ,hat erfolgreich die Prüfung SP1 absolviert. Zeit:","Fahrer Michael Gotta mit der StartNr. 56 ,hat erfolgreich die Prüfung SP1 absolviert. Zeit:   ","00:00:01.350",1]
[57," Stefanie","Rinck",57,"00:00:07,76","00:00:01.35","00:00:07,76","00:00:00.760","","Fahrer"," ","mit der StartNr. ",",hat erfolgreich die Prüfung SP1 absolviert. Zeit:","Fahrer Stefanie Rinck mit der StartNr. 57 ,hat erfolgreich die Prüfung SP1 absolviert. Zeit:","Fahrer Stefanie Rinck mit der StartNr. 57 ,hat erfolgreich die Prüfung SP1 absolviert. Zeit:   ","00:00:00.760",1]
[58," Armin","Slotta",58,"00:00:08,20","00:00:01.20","00:00:08,20","00:00:01.200","","Fahrer"," ","mit der StartNr. ",",hat erfolgreich die Prüfung SP1 absolviert. Zeit:","Fahrer Armin Slotta mit der StartNr. 58 ,hat erfolgreich die Prüfung SP1 absolviert. Zeit:","Fahrer Armin Slotta mit der StartNr. 58 ,hat erfolgreich die Prüfung SP1 absolviert. Zeit:   ","00:00:01.200",1]
[59," Julia","Kende",59,"00:00:07,42","00:00:01.20","00:00:07,42","00:00:00.420","","Fahrer"," ","mit der StartNr. ",",hat erfolgreich die Prüfung SP1 absolviert. Zeit:","Fahrer Julia Kende mit der StartNr. 59 ,hat erfolgreich die Prüfung SP1 absolviert. Zeit:","Fahrer Julia Kende mit der StartNr. 59 ,hat erfolgreich die Prüfung SP1 absolviert. Zeit:   ","00:00:00.420",1]
[60," Robert","Bleckmann",60,"00:00:07,88","00:00:01.20","00:00:07,88","00:00:00.880","","Fahrer"," ","mit der StartNr. ",",hat erfolgreich die Prüfung SP1 absolviert. Zeit:","Fahrer Robert Bleckmann mit der StartNr. 60 ,hat erfolgreich die Prüfung SP1 absolviert. Zeit:","Fahrer Robert Bleckmann mit der StartNr. 60 ,hat erfolgreich die Prüfung SP1 absolviert. Zeit:   ","00:00:00.880",1]
[61," Christof","Harwardt",61,"00:00:07,52","00:00:01.20","00:00:07,52","00:00:00.520","","Fahrer"," ","mit der StartNr. ",",hat erfolgreich die Prüfung SP1 absolviert. Zeit:","Fahrer Christof Harwardt mit der StartNr. 61 ,hat erfolgreich die Prüfung SP1 absolviert. Zeit:","Fahrer Christof Harwardt mit der StartNr. 61 ,hat erfolgreich die Prüfung SP1 absolviert. Zeit:   ","00:00:00.520",1]
[62," Thomas","Kahns",62,"00:00:08,76","00:00:01.76","00:00:08,76","00:00:01.760","","Fahrer"," ","mit der StartNr. ",",hat erfolgreich die Prüfung SP1 absolviert. Zeit:","Fahrer Thomas Kahns mit der StartNr. 62 ,hat erfolgreich die Prüfung SP1 absolviert. Zeit:","Fahrer Thomas Kahns mit der StartNr. 62 ,hat erfolgreich die Prüfung SP1 absolviert. Zeit:   ","00:00:01.760",1]
[63," Maximilian","Herbst",63,"00:00:06,48","00:00:00.52","00:00:06,48","00:00:00.520","","Fahrer"," ","mit der StartNr. ",",hat erfolgreich die Prüfung SP1 absolviert. Zeit:","Fahrer Maximilian Herbst mit der StartNr. 63 ,hat erfolgreich die Prüfung SP1 absolviert. Zeit:","Fahrer Maximilian Herbst mit der StartNr. 63 ,hat erfolgreich die Prüfung SP1 absolviert. Zeit:   ","00:00:00.520",1]
[64," Jürgen","Buchhold",64,"00:00:07,06","00:00:00.52","00:00:07,06","00:00:00.060","","Fahrer"," ","mit der StartNr. ",",hat erfolgreich die Prüfung SP1 absolviert. Zeit:","Fahrer Jürgen Buchhold mit der StartNr. 64 ,hat erfolgreich die Prüfung SP1 absolviert. Zeit:","Fahrer Jürgen Buchhold mit der StartNr. 64 ,hat erfolgreich die Prüfung SP1 absolviert. Zeit:   ","00:00:00.060",1]
[65," Oliver","Klink",65,"Keine Zeit","———","",{"$error":"#VALUE!"},"","Fahrer"," ","mit der StartNr. ",",hat erfolgreich die Prüfung SP1 absolviert. Zeit:","Fahrer Oliver Klink mit der StartNr. 65 ,hat erfolgreich die Prüfung SP1 absolviert. Zeit:","","",""]
[66," Peter","Bel",66,"00:00:07,76","00:00:00.52",{"$f":"IF(E67=\"Keine Zeit\",\"\",E67)","v":"00:00:07,76"},{"$f":"ABS(G67-$G$1)","v":"00:00:00.760"},{"$f":"IF(G67<=$G$1,\"-\",\"\")","v":""},"Fahrer"," ","mit der StartNr. ",",hat erfolgreich die Prüfung SP1 absolviert. Zeit:",{"$f":"J67&B67&K67&C67&K67&L67&A67&K67&M67","v":"Fahrer Peter Bel mit der StartNr. 66 ,hat erfolgreich die Prüfung SP1 absolviert. Zeit:"},{"$f":"IF(ISERROR(H67),\"\",J67&B67&K67&C67&K67&L67&A67&K67&M67&K67&K67&K67&I67)","v":"Fahrer Peter Bel mit der StartNr. 66 ,hat erfolgreich die Prüfung SP1 absolviert. Zeit:   "},{"$f":"IF(ISERROR(H67),\"\",H67)","v":"00:00:00.760"},{"$f":"IF(P67=\"\",\"\",1)","v":1}]
[67," Thomas","Mirau",67,"00:00:07,59","00:00:00.52","00:00:07,59","00:00:00.590","","Fahrer"," ","mit der StartNr. ",",hat erfolgreich die Prüfung SP1 absolviert. Zeit:","Fahrer Thomas Mirau mit der StartNr. 67 ,hat erfolgreich die Prüfung SP1 absolviert. Zeit:","Fahrer Thomas Mirau mit der StartNr. 67 ,hat erfolgreich die Prüfung SP1 absolviert. Zeit:   ","00:00:00.590",1]
[68," Markus","Gotta",68,"00:00:08,44","00:00:01.44","00:00:08,44","00:00:01.440","","Fahrer"," ","mit der StartNr. ",",hat erfolgreich die Prüfung SP1 absolviert. Zeit:","Fahrer Markus Gotta mit der StartNr. 68 ,hat erfolgreich die Prüfung SP1 absolviert. Zeit:","Fahrer Markus Gotta mit der StartNr. 68 ,hat erfolgreich die Prüfung SP1 absolviert. Zeit:   ","00:00:01.440",1]
[69," Robin","Keulertz",69,"00:00:08,11","00:00:01.11","00:00:08,11","00:00:01.110","","Fahrer"," ","mit der StartNr. ",",hat erfolgreich die Prüfung SP1 absolviert. Zeit:","Fahrer Robin Keulertz mit der StartNr. 69 ,hat erfolgreich die Prüfung SP1 absolviert. Zeit:","Fahrer Robin Keulertz mit der StartNr. 69 ,hat erfolgreich die Prüfung SP1 absolviert. Zeit:   ","00:00:01.110",1]
[70," Christian","Häp",70,"00:00:08,75","00:00:01.75","00:00:08,75","00:00:01.750","","Fahrer"," ","mit der StartNr. ",",hat erfolgreich die Prüfung SP1 absolviert. Zeit:","Fahrer Christian Häp mit der StartNr. 70 ,hat erfolgreich die Prüfung SP1 absolviert. Zeit:","Fahrer Christian Häp mit der StartNr. 70 ,hat erfolgreich die Prüfung SP1 absolviert. Zeit:   ","00:00:01.750",1]
[71," Ingolf","Zschockelt",71,"00:00:07,96","00:00:01.75","00:00:07,96","00:00:00.960","","Fahrer"," ","mit der StartNr. ",",hat erfolgreich die Prüfung SP1 absolviert. Zeit:","Fahrer Ingolf Zschockelt mit der StartNr. 71 ,hat erfolgreich die Prüfung SP1 absolviert. Zeit:","Fahrer Ingolf Zschockelt mit der StartNr. 71 ,hat erfolgreich die Prüfung SP1 absolviert. Zeit:   ","00:00:00.960",1]
[72," Michael","Barsties",72,"00:00:08,12","00:00:01.12","00:00:08,12","00:00:01.120","","Fahrer"," ","mit der StartNr. ",",hat erfolgreich die Prüfung SP1 absolviert. Zeit:","Fahrer Michael Barsties mit der StartNr. 72 ,hat erfolgreich die Prüfung SP1 absolviert. Zeit:","Fahrer Michael Barsties mit der StartNr. 72 ,hat erfolgreich die Prüfung SP1 absolviert. Zeit:   ","00:00:01.120",1]
[73," Ramona","Wagner",73,"00:00:07,75","00:00:01.12","00:00:07,75","00:00:00.750","","Fahrer"," ","mit der StartNr. ",",hat erfolgreich die Prüfung SP1 absolviert. Zeit:","Fahrer Ramona Wagner mit der StartNr. 73 ,hat erfolgreich die Prüfung SP1 absolviert. Zeit:","Fahrer Ramona Wagner mit der StartNr. 73 ,hat erfolgreich die Prüfung SP1 absolviert. Zeit:   ","00:00:00.750",1]
[74," Lars","Fahrenbach",74,"00:00:10,61","00:00:05.39","00:00:10,61","00:00:03.610","","Fahrer"," ","mit der StartNr. ",",hat erfolgreich die Prüfung SP1 absolviert. Zeit:","Fahrer Lars Fahrenbach mit der StartNr. 74 ,hat erfolgreich die Prüfung SP1 absolviert. Zeit:","Fahrer Lars Fahrenbach mit der StartNr. 74 ,hat erfolgreich die Prüfung SP1 absolviert. Zeit:   ","00:00:03.610",1]
[75," Frank","Hoefnagels",75,"00:00:06,13","00:00:00.87","00:00:06,13","00:00:00.870","","Fahrer"," ","mit der StartNr. ",",hat erfolgreich die Prüfung SP1 absolviert. Zeit:","Fahrer Frank Hoefnagels mit der StartNr. 75 ,hat erfolgreich die Prüfung SP1 absolviert. Zeit:","Fahrer Frank Hoefnagels mit der StartNr. 75 ,hat erfolgreich die Prüfung SP1 absolviert. Zeit:   ","00:00:00.870",1]
[76," Michael","Karch",76,"00:00:08,50","00:00:01.50","00:00:08,50","00:00:01.500","","Fahrer"," ","mit der StartNr. ",",hat erfolgreich die Prüfung SP1 absolviert. Zeit:","Fahrer Michael Karch mit der StartNr. 76 ,hat erfolgreich die Prüfung SP1 absolviert. Zeit:","Fahrer Michael Karch mit der StartNr. 76 ,hat erfolgreich die Prüfung SP1 absolviert. Zeit:   ","00:00:01.500",1]
[77," Dirk","Götze",77,"00:00:06,96","00:00:00.04","00:00:06,96","00:00:00.040","","Fahrer"," ","mit der StartNr. ",",hat erfolgreich die Prüfung SP1 absolviert. Zeit:","Fahrer Dirk Götze mit der StartNr. 77 ,hat erfolgreich die Prüfung SP1 absolviert. Zeit:","Fahrer Dirk Götze mit der StartNr. 77 ,hat erfolgreich die Prüfung SP1 absolviert. Zeit:   ","00:00:00.040",1]
[78," Stefan","Hillers",78,"00:00:09,28","00:00:02.28","00:00:09,28","00:00:02.280","","Fahrer"," ","mit der StartNr. ",",hat erfolgreich die Prüfung SP1 absolviert. Zeit:","Fahrer Stefan Hillers mit der StartNr. 78 ,hat erfolgreich die Prüfung SP1 absolviert. Zeit:","Fahrer Stefan Hillers mit der StartNr. 78 ,hat erfolgreich die Prüfung SP1 absolviert. Zeit:   ","00:00:02.280",1]
[79," Christian","Rafflenbeul",79,"00:00:07,94","00:00:02.28","00:00:07,94","00:00:00.940","","Fahrer"," ","mit der StartNr. ",",hat erfolgreich die Prüfung SP1 absolviert. Zeit:","Fahrer Christian Rafflenbeul mit der StartNr. 79 ,hat erfolgreich die Prüfung SP1 absolviert. Zeit:","Fahrer Christian Rafflenbeul mit der StartNr. 79 ,hat erfolgreich die Prüfung SP1 absolviert. Zeit:   ","00:00:00.940",1]
[80," Gerhard","Reuschel",80,"00:00:07,50","00:00:02.28","00:00:07,50","00:00:00.500","","Fahrer"," ","mit der StartNr. ",",hat erfolgreich die Prüfung SP1 absolviert. Zeit:","Fahrer Gerhard Reuschel mit der StartNr. 80 ,hat erfolgreich die Prüfung SP1 absolviert. Zeit:","Fahrer Gerhard Reuschel mit der StartNr. 80 ,hat erfolgreich die Prüfung SP1 absolviert. Zeit:   ","00:00:00.500",1]
[81," Karsten","Rachow",81,"00:00:11,57","00:00:05.43","00:00:11,57","00:00:04.570","","Fahrer"," ","mit der StartNr. ",",hat erfolgreich die Prüfung SP1 absolviert. Zeit:","Fahrer Karsten Rachow mit der StartNr. 81 ,hat erfolgreich die Prüfung SP1 absolviert. Zeit:","Fahrer Karsten Rachow mit der StartNr. 81 ,hat erfolgreich die Prüfung SP1 absolviert. Zeit:   ","00:00:04.570",1]
[82," Jürgen","Ziller",82,"00:00:07,97","00:00:05.43","00:00:07,97","00:00:00.970","","Fahrer"," ","mit der StartNr. ",",hat erfolgreich die Prüfung SP1 absolviert. Zeit:","Fahrer Jürgen Ziller mit der StartNr. 82 ,hat erfolgreich die Prüfung SP1 absolviert. Zeit:","Fahrer Jürgen Ziller mit der StartNr. 82 ,hat erfolgreich die Prüfung SP1 absolviert. Zeit:   ","00:00:00.970",1]
[83," Alexander","Weil",83,"00:00:07,88","00:00:05.43","00:00:07,88","00:00:00.880","","Fahrer"," ","mit der StartNr. ",",hat erfolgreich die Prüfung SP1 absolviert. Zeit:","Fahrer Alexander Weil mit der StartNr. 83 ,hat erfolgreich die Prüfung SP1 absolviert. Zeit:","Fahrer Alexander Weil mit der StartNr. 83 ,hat erfolgreich die Prüfung SP1 absolviert. Zeit:   ","00:00:00.880",1]
[84," Josef","Lindenberger",84,"00:00:10,27","00:00:05.73","00:00:10,27","00:00:03.270","","Fahrer"," ","mit der StartNr. ",",hat erfolgreich die Prüfung SP1 absolviert. Zeit:","Fahrer Josef Lindenberger mit der StartNr. 84 ,hat erfolgreich die Prüfung SP1 absolviert. Zeit:","Fahrer Josef Lindenberger mit der StartNr. 84 ,hat erfolgreich die Prüfung SP1 absolviert. Zeit:   ","00:00:03.270",1]
[85," Rick","Durante",85,"00:00:09,94","00:00:02.94","00:00:09,94","00:00:02.940","","Fahrer"," ","mit der StartNr. ",",hat erfolgreich die Prüfung SP1 absolviert. Zeit:","Fahrer Rick Durante mit der StartNr. 85 ,hat erfolgreich die Prüfung SP1 absolviert. Zeit:","Fahrer Rick Durante mit der StartNr. 85 ,hat erfolgreich die Prüfung SP1 absolviert. Zeit:   ","00:00:02.940",1]
[86," Almuth","Siemann",86,"00:00:09,96","00:00:02.96","00:00:09,96","00:00:02.960","","Fahrer"," ","mit der StartNr. ",",hat erfolgreich die Prüfung SP1 absolviert. Zeit:","Fahrer Almuth Siemann mit der StartNr. 86 ,hat erfolgreich die Prüfung SP1 absolviert. Zeit:","Fahrer Almuth Siemann mit der StartNr. 86 ,hat erfolgreich die Prüfung SP1 absolviert. Zeit:   ","00:00:02.960",1]
[87," Axel","Strigl",87,"00:00:11,78","00:00:05.22","00:00:11,78","00:00:04.780","","Fahrer"," ","mit der StartNr. ",",hat erfolgreich die Prüfung SP1 absolviert. Zeit:","Fahrer Axel Strigl mit der StartNr. 87 ,hat erfolgreich die Prüfung SP1 absolviert. Zeit:","Fahrer Axel Strigl mit der StartNr. 87 ,hat erfolgreich die Prüfung SP1 absolviert. Zeit:   ","00:00:04.780",1]
[88," Philip","Sommer",88,"00:00:07,46","00:00:05.22","00:00:07,46","00:00:00.460","","Fahrer"," ","mit der StartNr. ",",hat erfolgreich die Prüfung SP1 absolviert. Zeit:","Fahrer Philip Sommer mit der StartNr. 88 ,hat erfolgreich die Prüfung SP1 absolviert. Zeit:","Fahrer Philip Sommer mit der StartNr. 88 ,hat erfolgreich die Prüfung SP1 absolviert. Zeit:   ","00:00:00.460",1]
[89," Jörg","Diehl",89,"00:00:07,89","00:00:05.22","00:00:07,89","00:00:00.890","","Fahrer"," ","mit der StartNr. ",",hat erfolgreich die Prüfung SP1 absolviert. Zeit:","Fahrer Jörg Diehl mit der StartNr. 89 ,hat erfolgreich die Prüfung SP1 absolviert. Zeit:","Fahrer Jörg Diehl mit der StartNr. 89 ,hat erfolgreich die Prüfung SP1 absolviert. Zeit:   ","00:00:00.890",1]
[90," Matthias","Herzig",90,"00:00:08,35","00:00:01.35","00:00:08,35","00:00:01.350","","Fahrer"," ","mit der StartNr. ",",hat erfolgreich die Prüfung SP1 absolviert. Zeit:","Fahrer Matthias Herzig mit der StartNr. 90 ,hat erfolgreich die Prüfung SP1 absolviert. Zeit:","Fahrer Matthias Herzig mit der StartNr. 90 ,hat erfolgreich die Prüfung SP1 absolviert. Zeit:   ","00:00:01.350",1]
[91," Christoph","Pasternak",91,"00:00:06,31","00:00:00.69","00:00:06,31","00:00:00.690","","Fahrer"," ","mit der StartNr. ",",hat erfolgreich die Prüfung SP1 absolviert. Zeit:","Fahrer Christoph Pasternak mit der StartNr. 91 ,hat erfolgreich die Prüfung SP1 absolviert. Zeit:","Fahrer Christoph Pasternak mit der StartNr. 91 ,hat erfolgreich die Prüfung SP1 absolviert. Zeit:   ","00:00:00.690",1]
[92," Lothar","Schupet",92,"00:00:07,06","00:00:00.69","00:00:07,06","00:00:00.060","","Fahrer"," ","mit der StartNr. ",",hat erfolgreich die Prüfung SP1 absolviert. Zeit:","Fahrer Lothar Schupet mit der StartNr. 92 ,hat erfolgreich die Prüfung SP1 absolviert. Zeit:","Fahrer Lothar Schupet mit der StartNr. 92 ,hat erfolgreich die Prüfung SP1 absolviert. Zeit:   ","00:00:00.060",1]
[93," Wolfgang","Schertler",93,"00:00:07,82","00:00:00.69","00:00:07,82","00:00:00.820","","Fahrer"," ","mit der StartNr. ",",hat erfolgreich die Prüfung SP1 absolviert. Zeit:","Fahrer Wolfgang Schertler mit der StartNr. 93 ,hat erfolgreich die Prüfung SP1 absolviert. Zeit:","Fahrer Wolfgang Schertler mit der StartNr. 93 ,hat erfolgreich die Prüfung SP1 absolviert. Zeit:   ","00:00:00.820",1]
[94," Thomas","Katzensteiner",94,"00:00:08,16","00:00:01.16","00:00:08,16","00:00:01.160","","Fahrer"," ","mit der StartNr. ",",hat erfolgreich die Prüfung SP1 absolviert. Zeit:","Fahrer Thomas Katzensteiner mit der StartNr. 94 ,hat erfolgreich die Prüfung SP1 absolviert. Zeit:","Fahrer Thomas Katzensteiner mit der StartNr. 94 ,hat erfolgreich die Prüfung SP1 absolviert. Zeit:   ","00:00:01.160",1]
[95," Hagen","Hackenberg",95,"00:00:07,24","00:00:01.16","00:00:07,24","00:00:00.240","","Fahrer"," ","mit der StartNr. ",",hat erfolgreich die Prüfung SP1 absolviert. Zeit:","Fahrer Hagen Hackenberg mit der StartNr. 95 ,hat erfolgreich die Prüfung SP1 absolviert. Zeit:","Fahrer Hagen Hackenberg mit der StartNr. 95 ,hat erfolgreich die Prüfung SP1 absolviert. Zeit:   ","00:00:00.240",1]
[96," Oliver","Dietz",96,"00:00:07,06","00:00:01.16","00:00:07,06","00:00:00.060","","Fahrer"," ","mit der StartNr. ",",hat erfolgreich die Prüfung SP1 absolviert. Zeit:","Fahrer Oliver Dietz mit der StartNr. 96 ,hat erfolgreich die Prüfung SP1 absolviert. Zeit:","Fahrer Oliver Dietz mit der StartNr. 96 ,hat erfolgreich die Prüfung SP1 absolviert. Zeit:   ","00:00:00.060",1]
[97," Horst","Kempf",97,"00:00:07,76","00:00:01.16","00:00:07,76","00:00:00.760","","Fahrer"," ","mit der StartNr. ",",hat erfolgreich die Prüfung SP1 absolviert. Zeit:","Fahrer Horst Kempf mit der StartNr. 97 ,hat erfolgreich die Prüfung SP1 absolviert. Zeit:","Fahrer Horst Kempf mit der StartNr. 97 ,hat erfolgreich die Prüfung SP1 absolviert. Zeit:   ","00:00:00.760",1]
[98," Detlev","Pauer",98,"00:00:11,23","00:00:05.77","00:00:11,23","00:00:04.230","","Fahrer"," ","mit der StartNr. ",",hat erfolgreich die Prüfung SP1 absolviert. Zeit:","Fahrer Detlev Pauer mit der StartNr. 98 ,hat erfolgreich die Prüfung SP1 absolviert. Zeit:","Fahrer Detlev Pauer mit der StartNr. 98 ,hat erfolgreich die Prüfung SP1 absolviert. Zeit:   ","00:00:04.230",1]
[99," Dirk","Velte",99,"00:00:07,69","00:00:05.77","00:00:07,69","00:00:00.690","","Fahrer"," ","mit der StartNr. ",",hat erfolgreich die Prüfung SP1 absolviert. Zeit:","Fahrer Dirk Velte mit der StartNr. 99 ,hat erfolgreich die Prüfung SP1 absolviert. Zeit:","Fahrer Dirk Velte mit der StartNr. 99 ,hat erfolgreich die Prüfung SP1 absolviert. Zeit:   ","00:00:00.690",1]
[100," Thorsten","Krack",100,"00:00:07,11","00:00:05.77","00:00:07,11","00:00:00.110","","Fahrer"," ","mit der StartNr. ",",hat erfolgreich die Prüfung SP1 absolviert. Zeit:","Fahrer Thorsten Krack mit der StartNr. 100 ,hat erfolgreich die Prüfung SP1 absolviert. Zeit:","Fahrer Thorsten Krack mit der StartNr. 100 ,hat erfolgreich die Prüfung SP1 absolviert. Zeit:   ","00:00:00.110",1]
[101," Christian","Wittek",101,"00:00:07,14","00:00:05.77","00:00:07,14","00:00:00.140","","Fahrer"," ","mit der StartNr. ",",hat erfolgreich die Prüfung SP1 absolviert. Zeit:","Fahrer Christian Wittek mit der StartNr. 101 ,hat erfolgreich die Prüfung SP1 absolviert. Zeit:","Fahrer Christian Wittek mit der StartNr. 101 ,hat erfolgreich die Prüfung SP1 absolviert. Zeit:   ","00:00:00.140",1]
[102," Benjamin","Hix",102,"00:00:08,19","00:00:01.19","00:00:08,19","00:00:01.190","","Fahrer"," ","mit der StartNr. ",",hat erfolgreich die Prüfung SP1 absolviert. Zeit:","Fahrer Benjamin Hix mit der StartNr. 102 ,hat erfolgreich die Prüfung SP1 absolviert. Zeit:","Fahrer Benjamin Hix mit der StartNr. 102 ,hat erfolgreich die Prüfung SP1 absolviert. Zeit:   ","00:00:01.190",1]
[null,null,null,null,null,null,null,null,null,null,null,null,null,null,null,null,{"$f":"SUM(Q2:Q103)","v":100}]

{"sheet":"SP2_Sprint","index":1,"n_rows":104,"n_cols":17,"rows_kept":104,"cut":false,"hidden":false,"merged":[]}
[null,null,null,"#","Fahrtzeit","Abweichung","00:00:08","Diff.",null,null,null,null,null,null,"bitte auf das Vorzeichen \"-\" achten!","m:ss,00"]
[1," Christian","Jäger",1,"00:00:08,08","00:00:00.00","00:00:08.080",{"$f":"ABS(G2-$G$1)","v":"00:00:00.080"},{"$f":"IF(G2<=$G$1,\"-\",\"\")","v":""},"Fahrer"," ","mit der StartNr. ",",hat erfolgreich die Prüfung SP2 absolviert. Zeit:",{"$f":"J2&B2&K2&C2&K2&L2&A2&K2&M2","v":"Fahrer Christian Jäger mit der StartNr. 1 ,hat erfolgreich die Prüfung SP2 absolviert. Zeit:"},{"$f":"IF(ISERROR(H2),\"\",J2&B2&K2&C2&K2&L2&A2&K2&M2&K2&I2)","v":"Fahrer Christian Jäger mit der StartNr. 1 ,hat erfolgreich die Prüfung SP2 absolviert. Zeit: "},{"$f":"IF(ISERROR(H2),\"\",H2)","v":"00:00:00.080"},{"$f":"IF(P2=\"\",\"\",1)","v":1}]
[2," Daniel","Rinck",2,"00:00:09,54","00:00:01.54","00:00:09.540",{"$f":"ABS(G3-$G$1)","v":"00:00:01.540"},{"$f":"IF(G3<=$G$1,\"-\",\"\")","v":""},"Fahrer"," ","mit der StartNr. ",",hat erfolgreich die Prüfung SP2 absolviert. Zeit:",{"$f":"J3&B3&K3&C3&K3&L3&A3&K3&M3","v":"Fahrer Daniel Rinck mit der StartNr. 2 ,hat erfolgreich die Prüfung SP2 absolviert. Zeit:"},{"$f":"IF(ISERROR(H3),\"\",J3&B3&K3&C3&K3&L3&A3&K3&M3&K3&I3)","v":"Fahrer Daniel Rinck mit der StartNr. 2 ,hat erfolgreich die Prüfung SP2 absolviert. Zeit: "},{"$f":"IF(ISERROR(H3),\"\",H3)","v":"00:00:01.540"},{"$f":"IF(P3=\"\",\"\",1)","v":1}]
[3," Malte","Proff-Klein",3,"Keine Zeit","———","00:00:08.440","00:00:00.440","","Fahrer"," ","mit der StartNr. ",",hat erfolgreich die Prüfung SP2 absolviert. Zeit:","Fahrer Malte Proff-Klein mit der StartNr. 3 ,hat erfolgreich die Prüfung SP2 absolviert. Zeit:","Fahrer Malte Proff-Klein mit der StartNr. 3 ,hat erfolgreich die Prüfung SP2 absolviert. Zeit: ","00:00:00.440",1]
[4," Dietmar","Siemssen",4,"00:00:08,55","00:00:01.54","00:00:08.550","00:00:00.550","","Fahrer"," ","mit der StartNr. ",",hat erfolgreich die Prüfung SP2 absolviert. Zeit:","Fahrer Dietmar Siemssen mit der StartNr. 4 ,hat erfolgreich die Prüfung SP2 absolviert. Zeit:","Fahrer Dietmar Siemssen mit der StartNr. 4 ,hat erfolgreich die Prüfung SP2 absolviert. Zeit: ","00:00:00.550",1]
[5," Franz-Michael","Hartmann",5,"00:00:08,83","00:00:01.54","00:00:08.830","00:00:00.830","","Fahrer"," ","mit der StartNr. ",",hat erfolgreich die Prüfung SP2 absolviert. Zeit:","Fahrer Franz-Michael Hartmann mit der StartNr. 5 ,hat erfolgreich die Prüfung SP2 absolviert. Zeit:","Fahrer Franz-Michael Hartmann mit der StartNr. 5 ,hat erfolgreich die Prüfung SP2 absolviert. Zeit: ","00:00:00.830",1]
[6," Christoph","Schroer",6,"Keine Zeit","———","00:00:07.740","00:00:00.260","-","Fahrer"," ","mit der StartNr. ",",hat erfolgreich die Prüfung SP2 absolviert. Zeit:","Fahrer Christoph Schroer mit der StartNr. 6 ,hat erfolgreich die Prüfung SP2 absolviert. Zeit:","Fahrer Christoph Schroer mit der StartNr. 6 ,hat erfolgreich die Prüfung SP2 absolviert. Zeit: -","00:00:00.260",1]
[7," Jochen","Artzinger-Bolten",7,"Keine Zeit","———","00:00:08.180","00:00:00.180","","Fahrer"," ","mit der StartNr. ",",hat erfolgreich die Prüfung SP2 absolviert. Zeit:","Fahrer Jochen Artzinger-Bolten mit der StartNr. 7 ,hat erfolgreich die Prüfung SP2 absolviert. Zeit:","Fahrer Jochen Artzinger-Bolten mit der StartNr. 7 ,hat erfolgreich die Prüfung SP2 absolviert. Zeit: ","00:00:00.180",1]
[8," Friedhelm","Eickhorn",8,"Keine Zeit","———","00:00:09.270","00:00:01.270","","Fahrer"," ","mit der StartNr. ",",hat erfolgreich die Prüfung SP2 absolviert. Zeit:","Fahrer Friedhelm Eickhorn mit der StartNr. 8 ,hat erfolgreich die Prüfung SP2 absolviert. Zeit:","Fahrer Friedhelm Eickhorn mit der StartNr. 8 ,hat erfolgreich die Prüfung SP2 absolviert. Zeit: ","00:00:01.270",1]
[9," Carsten","Reblin",9,"Keine Zeit","———","00:00:08.910","00:00:00.910","","Fahrer"," ","mit der StartNr. ",",hat erfolgreich die Prüfung SP2 absolviert. Zeit:","Fahrer Carsten Reblin mit der StartNr. 9 ,hat erfolgreich die Prüfung SP2 absolviert. Zeit:","Fahrer Carsten Reblin mit der StartNr. 9 ,hat erfolgreich die Prüfung SP2 absolviert. Zeit: ","00:00:00.910",1]
[10," Dieter","Dinges",10,"Keine Zeit","———","00:00:08.620","00:00:00.620","","Fahrer"," ","mit der StartNr. ",",hat erfolgreich die Prüfung SP2 absolviert. Zeit:","Fahrer Dieter Dinges mit der StartNr. 10 ,hat erfolgreich die Prüfung SP2 absolviert. Zeit:","Fahrer Dieter Dinges mit der StartNr. 10 ,hat erfolgreich die Prüfung SP2 absolviert. Zeit: ","00:00:00.620",1]
[11," Wolfgang","Reeh",11,"Keine Zeit","———","00:00:09.220","00:00:01.220","","Fahrer"," ","mit der StartNr. ",",hat erfolgreich die Prüfung SP2 absolviert. Zeit:","Fahrer Wolfgang Reeh mit der StartNr. 11 ,hat erfolgreich die Prüfung SP2 absolviert. Zeit:","Fahrer Wolfgang Reeh mit der StartNr. 11 ,hat erfolgreich die Prüfung SP2 absolviert. Zeit: ","00:00:01.220",1]
[12," Andreas","Petry",12,"00:00:08,52","00:00:01.54","00:00:08.520","00:00:00.520","","Fahrer"," ","mit der StartNr. ",",hat erfolgreich die Prüfung SP2 absolviert. Zeit:","Fahrer Andreas Petry mit der StartNr. 12 ,hat erfolgreich die Prüfung SP2 absolviert. Zeit:","Fahrer Andreas Petry mit der StartNr. 12 ,hat erfolgreich die Prüfung SP2 absolviert. Zeit: ","00:00:00.520",1]
[13," Ted","Prenzel",13,"Keine Zeit","———","00:00:07.830","00:00:00.170","-","Fahrer"," ","mit der StartNr. ",",hat erfolgreich die Prüfung SP2 absolviert. Zeit:","Fahrer Ted Prenzel mit der StartNr. 13 ,hat erfolgreich die Prüfung SP2 absolviert. Zeit:","Fahrer Ted Prenzel mit der StartNr. 13 ,hat erfolgreich die Prüfung SP2 absolviert. Zeit: -","00:00:00.170",1]
[14," Micha","Barsties",14,"Keine Zeit","———","00:00:10.390","00:00:02.390","","Fahrer"," ","mit der StartNr. ",",hat erfolgreich die Prüfung SP2 absolviert. Zeit:","Fahrer Micha Barsties mit der StartNr. 14 ,hat erfolgreich die Prüfung SP2 absolviert. Zeit:","Fahrer Micha Barsties mit der StartNr. 14 ,hat erfolgreich die Prüfung SP2 absolviert. Zeit: ","00:00:02.390",1]
[15," Klaus","Flettner",15,"Keine Zeit","———","00:00:08.410","00:00:00.410","","Fahrer"," ","mit der StartNr. ",",hat erfolgreich die Prüfung SP2 absolviert. Zeit:","Fahrer Klaus Flettner mit der StartNr. 15 ,hat erfolgreich die Prüfung SP2 absolviert. Zeit:","Fahrer Klaus Flettner mit der StartNr. 15 ,hat erfolgreich die Prüfung SP2 absolviert. Zeit: ","00:00:00.410",1]
[16," Heinz","Frey",16,"00:00:08,73","00:00:01.54","00:00:08.730","00:00:00.730","","Fahrer"," ","mit der StartNr. ",",hat erfolgreich die Prüfung SP2 absolviert. Zeit:","Fahrer Heinz Frey mit der StartNr. 16 ,hat erfolgreich die Prüfung SP2 absolviert. Zeit:","Fahrer Heinz Frey mit der StartNr. 16 ,hat erfolgreich die Prüfung SP2 absolviert. Zeit: ","00:00:00.730",1]
[17," Henning","Reichel",17,"Keine Zeit","———","00:00:08.590","00:00:00.590","","Fahrer"," ","mit der StartNr. ",",hat erfolgreich die Prüfung SP2 absolviert. Zeit:","Fahrer Henning Reichel mit der StartNr. 17 ,hat erfolgreich die Prüfung SP2 absolviert. Zeit:","Fahrer Henning Reichel mit der StartNr. 17 ,hat erfolgreich die Prüfung SP2 absolviert. Zeit: ","00:00:00.590",1]
[18," Maik","Käbisch",18,"00:00:08,77","00:00:01.54","00:00:08.770","00:00:00.770","","Fahrer"," ","mit der StartNr. ",",hat erfolgreich die Prüfung SP2 absolviert. Zeit:","Fahrer Maik Käbisch mit der StartNr. 18 ,hat erfolgreich die Prüfung SP2 absolviert. Zeit:","Fahrer Maik Käbisch mit der StartNr. 18 ,hat erfolgreich die Prüfung SP2 absolviert. Zeit: ","00:00:00.770",1]
[19," Harald","Zapp",19,"Keine Zeit","———","00:00:07.680","00:00:00.320","-","Fahrer"," ","mit der StartNr. ",",hat erfolgreich die Prüfung SP2 absolviert. Zeit:","Fahrer Harald Zapp mit der StartNr. 19 ,hat erfolgreich die Prüfung SP2 absolviert. Zeit:","Fahrer Harald Zapp mit der StartNr. 19 ,hat erfolgreich die Prüfung SP2 absolviert. Zeit: -","00:00:00.320",1]
[20," Reinhard","Grzesik",20,"00:00:09,27","00:00:01.27","00:00:09.270","00:00:01.270","","Fahrer"," ","mit der StartNr. ",",hat erfolgreich die Prüfung SP2 absolviert. Zeit:","Fahrer Reinhard Grzesik mit der StartNr. 20 ,hat erfolgreich die Prüfung SP2 absolviert. Zeit:","Fahrer Reinhard Grzesik mit der StartNr. 20 ,hat erfolgreich die Prüfung SP2 absolviert. Zeit: ","00:00:01.270",1]
[21," Jörg","Sihler",21,"Keine Zeit","———","00:00:08.650","00:00:00.650","","Fahrer"," ","mit der StartNr. ",",hat erfolgreich die Prüfung SP2 absolviert. Zeit:","Fahrer Jörg Sihler mit der StartNr. 21 ,hat erfolgreich die Prüfung SP2 absolviert. Zeit:","Fahrer Jörg Sihler mit der StartNr. 21 ,hat erfolgreich die Prüfung SP2 absolviert. Zeit: ","00:00:00.650",1]
[22," Ingo","Winterstein",22,"Keine Zeit","———","00:00:08.230","00:00:00.230","","Fahrer"," ","mit der StartNr. ",",hat erfolgreich die Prüfung SP2 absolviert. Zeit:","Fahrer Ingo Winterstein mit der StartNr. 22 ,hat erfolgreich die Prüfung SP2 absolviert. Zeit:","Fahrer Ingo Winterstein mit der StartNr. 22 ,hat erfolgreich die Prüfung SP2 absolviert. Zeit: ","00:00:00.230",1]
[23," Hans Werner","Melchior",23,"00:00:09,29","00:00:01.29","00:00:09.290","00:00:01.290","","Fahrer"," ","mit der StartNr. ",",hat erfolgreich die Prüfung SP2 absolviert. Zeit:","Fahrer Hans Werner Melchior mit der StartNr. 23 ,hat erfolgreich die Prüfung SP2 absolviert. Zeit:","Fahrer Hans Werner Melchior mit der StartNr. 23 ,hat erfolgreich die Prüfung SP2 absolviert. Zeit: ","00:00:01.290",1]
[24," Marco","Oriolo",24,"00:00:07,71","00:00:00.29","00:00:07.710","00:00:00.290","-","Fahrer"," ","mit der StartNr. ",",hat erfolgreich die Prüfung SP2 absolviert. Zeit:","Fahrer Marco Oriolo mit der StartNr. 24 ,hat erfolgreich die Prüfung SP2 absolviert. Zeit:","Fahrer Marco Oriolo mit der StartNr. 24 ,hat erfolgreich die Prüfung SP2 absolviert. Zeit: -","00:00:00.290",1]
[25," Manfred","Stommel",25,"Keine Zeit","———","00:00:10.100","00:00:02.100","","Fahrer"," ","mit der StartNr. ",",hat erfolgreich die Prüfung SP2 absolviert. Zeit:","Fahrer Manfred Stommel mit der StartNr. 25 ,hat erfolgreich die Prüfung SP2 absolviert. Zeit:","Fahrer Manfred Stommel mit der StartNr. 25 ,hat erfolgreich die Prüfung SP2 absolviert. Zeit: ","00:00:02.100",1]
[26," Carolin","Heusel",26,"00:00:08,28","00:00:00.29","00:00:08.280","00:00:00.280","","Fahrer"," ","mit der StartNr. ",",hat erfolgreich die Prüfung SP2 absolviert. Zeit:","Fahrer Carolin Heusel mit der StartNr. 26 ,hat erfolgreich die Prüfung SP2 absolviert. Zeit:","Fahrer Carolin Heusel mit der StartNr. 26 ,hat erfolgreich die Prüfung SP2 absolviert. Zeit: ","00:00:00.280",1]
[27," Regina","Philippi",27,"Keine Zeit","———","00:00:08.950","00:00:00.950","","Fahrer"," ","mit der StartNr. ",",hat erfolgreich die Prüfung SP2 absolviert. Zeit:","Fahrer Regina Philippi mit der StartNr. 27 ,hat erfolgreich die Prüfung SP2 absolviert. Zeit:","Fahrer Regina Philippi mit der StartNr. 27 ,hat erfolgreich die Prüfung SP2 absolviert. Zeit: ","00:00:00.950",1]
[28," Christof","Aha",28,"Keine Zeit","———","00:00:09.490","00:00:01.490","","Fahrer"," ","mit der StartNr. ",",hat erfolgreich die Prüfung SP2 absolviert. Zeit:","Fahrer Christof Aha mit der StartNr. 28 ,hat erfolgreich die Prüfung SP2 absolviert. Zeit:","Fahrer Christof Aha mit der StartNr. 28 ,hat erfolgreich die Prüfung SP2 absolviert. Zeit: ","00:00:01.490",1]
[29," Dennis","Weiss",29,"00:00:09,42","00:00:01.42","00:00:09.420","00:00:01.420","","Fahrer"," ","mit der StartNr. ",",hat erfolgreich die Prüfung SP2 absolviert. Zeit:","Fahrer Dennis Weiss mit der StartNr. 29 ,hat erfolgreich die Prüfung SP2 absolviert. Zeit:","Fahrer Dennis Weiss mit der StartNr. 29 ,hat erfolgreich die Prüfung SP2 absolviert. Zeit: ","00:00:01.420",1]
[30," Harald","Hamprecht",30,"00:00:08,01","00:00:01.42","00:00:08.010","00:00:00.010","","Fahrer"," ","mit der StartNr. ",",hat erfolgreich die Prüfung SP2 absolviert. Zeit:","Fahrer Harald Hamprecht mit der StartNr. 30 ,hat erfolgreich die Prüfung SP2 absolviert. Zeit:","Fahrer Harald Hamprecht mit der StartNr. 30 ,hat erfolgreich die Prüfung SP2 absolviert. Zeit: ","00:00:00.010",1]
[31," Reno","Fiolic",31,"Keine Zeit","———","00:00:12.120","00:00:04.120","","Fahrer"," ","mit der StartNr. ",",hat erfolgreich die Prüfung SP2 absolviert. Zeit:","Fahrer Reno Fiolic mit der StartNr. 31 ,hat erfolgreich die Prüfung SP2 absolviert. Zeit:","Fahrer Reno Fiolic mit der StartNr. 31 ,hat erfolgreich die Prüfung SP2 absolviert. Zeit: ","00:00:04.120",1]
[32," Jürgen","Kulpe",32,"00:00:08,96","00:00:01.42","00:00:08.960","00:00:00.960","","Fahrer"," ","mit der StartNr. ",",hat erfolgreich die Prüfung SP2 absolviert. Zeit:","Fahrer Jürgen Kulpe mit der StartNr. 32 ,hat erfolgreich die Prüfung SP2 absolviert. Zeit:","Fahrer Jürgen Kulpe mit der StartNr. 32 ,hat erfolgreich die Prüfung SP2 absolviert. Zeit: ","00:00:00.960",1]
[33," Konstantin","Kovarbasic",33,"Keine Zeit","———","00:00:08.600","00:00:00.600","","Fahrer"," ","mit der StartNr. ",",hat erfolgreich die Prüfung SP2 absolviert. Zeit:","Fahrer Konstantin Kovarbasic mit der StartNr. 33 ,hat erfolgreich die Prüfung SP2 absolviert. Zeit:","Fahrer Konstantin Kovarbasic mit der StartNr. 33 ,hat erfolgreich die Prüfung SP2 absolviert. Zeit: ","00:00:00.600",1]
[34," Nikolaus","Kratz",34,"00:00:09,22","00:00:01.22","00:00:09.220","00:00:01.220","","Fahrer"," ","mit der StartNr. ",",hat erfolgreich die Prüfung SP2 absolviert. Zeit:","Fahrer Nikolaus Kratz mit der StartNr. 34 ,hat erfolgreich die Prüfung SP2 absolviert. Zeit:","Fahrer Nikolaus Kratz mit der StartNr. 34 ,hat erfolgreich die Prüfung SP2 absolviert. Zeit: ","00:00:01.220",1]
[35," Andreas","Eberhardt",35,"Keine Zeit","———","00:00:10.210","00:00:02.210","","Fahrer"," ","mit der StartNr. ",",hat erfolgreich die Prüfung SP2 absolviert. Zeit:","Fahrer Andreas Eberhardt mit der StartNr. 35 ,hat erfolgreich die Prüfung SP2 absolviert. Zeit:","Fahrer Andreas Eberhardt mit der StartNr. 35 ,hat erfolgreich die Prüfung SP2 absolviert. Zeit: ","00:00:02.210",1]
[36," Gerhard","Thomas",36,"00:00:08,90","00:00:01.22","00:00:08.900","00:00:00.900","","Fahrer"," ","mit der StartNr. ",",hat erfolgreich die Prüfung SP2 absolviert. Zeit:","Fahrer Gerhard Thomas mit der StartNr. 36 ,hat erfolgreich die Prüfung SP2 absolviert. Zeit:","Fahrer Gerhard Thomas mit der StartNr. 36 ,hat erfolgreich die Prüfung SP2 absolviert. Zeit: ","00:00:00.900",1]
[37," Lotzi","Kende",37,"00:00:08,42","00:00:01.22","00:00:08.420","00:00:00.420","","Fahrer"," ","mit der StartNr. ",",hat erfolgreich die Prüfung SP2 absolviert. Zeit:","Fahrer Lotzi Kende mit der StartNr. 37 ,hat erfolgreich die Prüfung SP2 absolviert. Zeit:","Fahrer Lotzi Kende mit der StartNr. 37 ,hat erfolgreich die Prüfung SP2 absolviert. Zeit: ","00:00:00.420",1]
[38," Jockel","Winkelhock",38,"00:00:08,16","00:00:01.22","00:00:08.160","00:00:00.160","","Fahrer"," ","mit der StartNr. ",",hat erfolgreich die Prüfung SP2 absolviert. Zeit:","Fahrer Jockel Winkelhock mit der StartNr. 38 ,hat erfolgreich die Prüfung SP2 absolviert. Zeit:","Fahrer Jockel Winkelhock mit der StartNr. 38 ,hat erfolgreich die Prüfung SP2 absolviert. Zeit: ","00:00:00.160",1]
[39," Sascha","Wilkesmann",39,"Keine Zeit","———","00:00:10.280","00:00:02.280","","Fahrer"," ","mit der StartNr. ",",hat erfolgreich die Prüfung SP2 absolviert. Zeit:","Fahrer Sascha Wilkesmann mit der StartNr. 39 ,hat erfolgreich die Prüfung SP2 absolviert. Zeit:","Fahrer Sascha Wilkesmann mit der StartNr. 39 ,hat erfolgreich die Prüfung SP2 absolviert. Zeit: ","00:00:02.280",1]
[40," Gregor","Schulz",40,"Keine Zeit","———","00:00:10.790","00:00:02.790","","Fahrer"," ","mit der StartNr. ",",hat erfolgreich die Prüfung SP2 absolviert. Zeit:","Fahrer Gregor Schulz mit der StartNr. 40 ,hat erfolgreich die Prüfung SP2 absolviert. Zeit:","Fahrer Gregor Schulz mit der StartNr. 40 ,hat erfolgreich die Prüfung SP2 absolviert. Zeit: ","00:00:02.790",1]
[41," Peer","Hildmann",41,"Keine Zeit","———","00:00:07.740","00:00:00.260","-","Fahrer"," ","mit der StartNr. ",",hat erfolgreich die Prüfung SP2 absolviert. Zeit:","Fahrer Peer Hildmann mit der StartNr. 41 ,hat erfolgreich die Prüfung SP2 absolviert. Zeit:","Fahrer Peer Hildmann mit der StartNr. 41 ,hat erfolgreich die Prüfung SP2 absolviert. Zeit: -","00:00:00.260",1]
[42," Mina","Tander",42,"00:00:07,72","00:00:00.28","00:00:07.720","00:00:00.280","-","Fahrer"," ","mit der StartNr. ",",hat erfolgreich die Prüfung SP2 absolviert. Zeit:","Fahrer Mina Tander mit der StartNr. 42 ,hat erfolgreich die Prüfung SP2 absolviert. Zeit:","Fahrer Mina Tander mit der StartNr. 42 ,hat erfolgreich die Prüfung SP2 absolviert. Zeit: -","00:00:00.280",1]
[43," Stefan","Iskan",43,"Keine Zeit","———","00:00:08.380","00:00:00.380","","Fahrer"," ","mit der StartNr. ",",hat erfolgreich die Prüfung SP2 absolviert. Zeit:","Fahrer Stefan Iskan mit der StartNr. 43 ,hat erfolgreich die Prüfung SP2 absolviert. Zeit:","Fahrer Stefan Iskan mit der StartNr. 43 ,hat erfolgreich die Prüfung SP2 absolviert. Zeit: ","00:00:00.380",1]
[44," Jean-Philippe","Kempf",44,"00:00:09,31","00:00:01.31","00:00:09.310","00:00:01.310","","Fahrer"," ","mit der StartNr. ",",hat erfolgreich die Prüfung SP2 absolviert. Zeit:","Fahrer Jean-Philippe Kempf mit der StartNr. 44 ,hat erfolgreich die Prüfung SP2 absolviert. Zeit:","Fahrer Jean-Philippe Kempf mit der StartNr. 44 ,hat erfolgreich die Prüfung SP2 absolviert. Zeit: ","00:00:01.310",1]
[45," Daniel","Martin",45,"00:00:08,72","00:00:01.31","00:00:08.720","00:00:00.720","","Fahrer"," ","mit der StartNr. ",",hat erfolgreich die Prüfung SP2 absolviert. Zeit:","Fahrer Daniel Martin mit der StartNr. 45 ,hat erfolgreich die Prüfung SP2 absolviert. Zeit:","Fahrer Daniel Martin mit der StartNr. 45 ,hat erfolgreich die Prüfung SP2 absolviert. Zeit: ","00:00:00.720",1]
[46," Elena","Funk",46,"00:00:09,10","00:00:01.10","00:00:09.100","00:00:01.100","","Fahrer"," ","mit der StartNr. ",",hat erfolgreich die Prüfung SP2 absolviert. Zeit:","Fahrer Elena Funk mit der StartNr. 46 ,hat erfolgreich die Prüfung SP2 absolviert. Zeit:","Fahrer Elena Funk mit der StartNr. 46 ,hat erfolgreich die Prüfung SP2 absolviert. Zeit: ","00:00:01.100",1]
[47," Hans","Mutschall",47,"Keine Zeit","———","00:00:07.780","00:00:00.220","-","Fahrer"," ","mit der StartNr. ",",hat erfolgreich die Prüfung SP2 absolviert. Zeit:","Fahrer Hans Mutschall mit der StartNr. 47 ,hat erfolgreich die Prüfung SP2 absolviert. Zeit:","Fahrer Hans Mutschall mit der StartNr. 47 ,hat erfolgreich die Prüfung SP2 absolviert. Zeit: -","00:00:00.220",1]
[48," Kahled","Rahman",48,"00:00:09,30","00:00:01.30","00:00:09.300","00:00:01.300","","Fahrer"," ","mit der StartNr. ",",hat erfolgreich die Prüfung SP2 absolviert. Zeit:","Fahrer Kahled Rahman mit der StartNr. 48 ,hat erfolgreich die Prüfung SP2 absolviert. Zeit:","Fahrer Kahled Rahman mit der StartNr. 48 ,hat erfolgreich die Prüfung SP2 absolviert. Zeit: ","00:00:01.300",1]
[49," Jochen","Schwarz",49,"00:00:08,13","00:00:01.30","00:00:08.130","00:00:00.130","","Fahrer"," ","mit der StartNr. ",",hat erfolgreich die Prüfung SP2 absolviert. Zeit:","Fahrer Jochen Schwarz mit der StartNr. 49 ,hat erfolgreich die Prüfung SP2 absolviert. Zeit:","Fahrer Jochen Schwarz mit der StartNr. 49 ,hat erfolgreich die Prüfung SP2 absolviert. Zeit: ","00:00:00.130",1]
[50," Axel","Nawrath",50,"Keine Zeit","———",null,null,"-","Fahrer"," ","mit der StartNr. ",",hat erfolgreich die Prüfung SP2 absolviert. Zeit:","Fahrer Axel Nawrath mit der StartNr. 50 ,hat erfolgreich die Prüfung SP2 absolviert. Zeit:",null,null,""]
[51," Birgit","Claussen",51,"00:00:09,22","00:00:01.22","00:00:09.220","00:00:01.220","","Fahrer"," ","mit der StartNr. ",",hat erfolgreich die Prüfung SP2 absolviert. Zeit:","Fahrer Birgit Claussen mit der StartNr. 51 ,hat erfolgreich die Prüfung SP2 absolviert. Zeit:","Fahrer Birgit Claussen mit der StartNr. 51 ,hat erfolgreich die Prüfung SP2 absolviert. Zeit: ","00:00:01.220",1]
[52," Harald","König",52,"00:00:09,06","00:00:01.06","00:00:09.060","00:00:01.060","","Fahrer"," ","mit der StartNr. ",",hat erfolgreich die Prüfung SP2 absolviert. Zeit:","Fahrer Harald König mit der StartNr. 52 ,hat erfolgreich die Prüfung SP2 absolviert. Zeit:","Fahrer Harald König mit der StartNr. 52 ,hat erfolgreich die Prüfung SP2 absolviert. Zeit: ","00:00:01.060",1]
[53," Thomas","Blank",53,"00:00:09,67","00:00:01.67","00:00:09.670","00:00:01.670","","Fahrer"," ","mit der StartNr. ",",hat erfolgreich die Prüfung SP2 absolviert. Zeit:","Fahrer Thomas Blank mit der StartNr. 53 ,hat erfolgreich die Prüfung SP2 absolviert. Zeit:","Fahrer Thomas Blank mit der StartNr. 53 ,hat erfolgreich die Prüfung SP2 absolviert. Zeit: ","00:00:01.670",1]
[54," Heidi","Eberhardt",54,"00:00:09,42","00:00:01.42","00:00:09.420","00:00:01.420","","Fahrer"," ","mit der StartNr. ",",hat erfolgreich die Prüfung SP2 absolviert. Zeit:","Fahrer Heidi Eberhardt mit der StartNr. 54 ,hat erfolgreich die Prüfung SP2 absolviert. Zeit:","Fahrer Heidi Eberhardt mit der StartNr. 54 ,hat erfolgreich die Prüfung SP2 absolviert. Zeit: ","00:00:01.420",1]
[55," Karina","Ansos",55,"Keine Zeit","———","00:00:07.720","00:00:00.280","-","Fahrer"," ","mit der StartNr. ",",hat erfolgreich die Prüfung SP2 absolviert. Zeit:","Fahrer Karina Ansos mit der StartNr. 55 ,hat erfolgreich die Prüfung SP2 absolviert. Zeit:","Fahrer Karina Ansos mit der StartNr. 55 ,hat erfolgreich die Prüfung SP2 absolviert. Zeit: -","00:00:00.280",1]
[56," Michael","Gotta",56,"Keine Zeit","———","00:00:10.060","00:00:02.060","","Fahrer"," ","mit der StartNr. ",",hat erfolgreich die Prüfung SP2 absolviert. Zeit:","Fahrer Michael Gotta mit der StartNr. 56 ,hat erfolgreich die Prüfung SP2 absolviert. Zeit:","Fahrer Michael Gotta mit der StartNr. 56 ,hat erfolgreich die Prüfung SP2 absolviert. Zeit: ","00:00:02.060",1]
[57," Stefanie","Rinck",57,"00:00:08,99","00:00:01.42","00:00:08.990","00:00:00.990","","Fahrer"," ","mit der StartNr. ",",hat erfolgreich die Prüfung SP2 absolviert. Zeit:","Fahrer Stefanie Rinck mit der StartNr. 57 ,hat erfolgreich die Prüfung SP2 absolviert. Zeit:","Fahrer Stefanie Rinck mit der StartNr. 57 ,hat erfolgreich die Prüfung SP2 absolviert. Zeit: ","00:00:00.990",1]
[58," Armin","Slotta",58,"Keine Zeit","———","00:00:10.390","00:00:02.390","","Fahrer"," ","mit der StartNr. ",",hat erfolgreich die Prüfung SP2 absolviert. Zeit:","Fahrer Armin Slotta mit der StartNr. 58 ,hat erfolgreich die Prüfung SP2 absolviert. Zeit:","Fahrer Armin Slotta mit der StartNr. 58 ,hat erfolgreich die Prüfung SP2 absolviert. Zeit: ","00:00:02.390",1]
[59," Julia","Kende",59,"Keine Zeit","———","00:00:08.530","00:00:00.530","","Fahrer"," ","mit der StartNr. ",",hat erfolgreich die Prüfung SP2 absolviert. Zeit:","Fahrer Julia Kende mit der StartNr. 59 ,hat erfolgreich die Prüfung SP2 absolviert. Zeit:","Fahrer Julia Kende mit der StartNr. 59 ,hat erfolgreich die Prüfung SP2 absolviert. Zeit: ","00:00:00.530",1]
[60," Robert","Bleckmann",60,"Keine Zeit","———","00:00:08.550","00:00:00.550","","Fahrer"," ","mit der StartNr. ",",hat erfolgreich die Prüfung SP2 absolviert. Zeit:","Fahrer Robert Bleckmann mit der StartNr. 60 ,hat erfolgreich die Prüfung SP2 absolviert. Zeit:","Fahrer Robert Bleckmann mit der StartNr. 60 ,hat erfolgreich die Prüfung SP2 absolviert. Zeit: ","00:00:00.550",1]
[61," Christof","Harwardt",61,"Keine Zeit","———","00:00:09.430","00:00:01.430","","Fahrer"," ","mit der StartNr. ",",hat erfolgreich die Prüfung SP2 absolviert. Zeit:","Fahrer Christof Harwardt mit der StartNr. 61 ,hat erfolgreich die Prüfung SP2 absolviert. Zeit:","Fahrer Christof Harwardt mit der StartNr. 61 ,hat erfolgreich die Prüfung SP2 absolviert. Zeit: ","00:00:01.430",1]
[62," Thomas","Kahns",62,"00:00:09,40","00:00:01.40","00:00:09.400","00:00:01.400","","Fahrer"," ","mit der StartNr. ",",hat erfolgreich die Prüfung SP2 absolviert. Zeit:","Fahrer Thomas Kahns mit der StartNr. 62 ,hat erfolgreich die Prüfung SP2 absolviert. Zeit:","Fahrer Thomas Kahns mit der StartNr. 62 ,hat erfolgreich die Prüfung SP2 absolviert. Zeit: ","00:00:01.400",1]
[63," Maximilian","Herbst",63,"Keine Zeit","———","00:00:07.960","00:00:00.040","-","Fahrer"," ","mit der StartNr. ",",hat erfolgreich die Prüfung SP2 absolviert. Zeit:","Fahrer Maximilian Herbst mit der StartNr. 63 ,hat erfolgreich die Prüfung SP2 absolviert. Zeit:","Fahrer Maximilian Herbst mit der StartNr. 63 ,hat erfolgreich die Prüfung SP2 absolviert. Zeit: -","00:00:00.040",1]
[64," Jürgen","Buchhold",64,"Keine Zeit","———","00:00:07.700","00:00:00.300","-","Fahrer"," ","mit der StartNr. ",",hat erfolgreich die Prüfung SP2 absolviert. Zeit:","Fahrer Jürgen Buchhold mit der StartNr. 64 ,hat erfolgreich die Prüfung SP2 absolviert. Zeit:","Fahrer Jürgen Buchhold mit der StartNr. 64 ,hat erfolgreich die Prüfung SP2 absolviert. Zeit: -","00:00:00.300",1]
[65," Oliver","Klink",65,"Keine Zeit","———",null,null,"-","Fahrer"," ","mit der StartNr. ",",hat erfolgreich die Prüfung SP2 absolviert. Zeit:","Fahrer Oliver Klink mit der StartNr. 65 ,hat erfolgreich die Prüfung SP2 absolviert. Zeit:",null,null,""]
[66," Peter","Bel",66,"Keine Zeit","———","00:00:07.200",{"$f":"ABS(G67-$G$1)","v":"00:00:00.800"},{"$f":"IF(G67<=$G$1,\"-\",\"\")","v":"-"},"Fahrer"," ","mit der StartNr. ",",hat erfolgreich die Prüfung SP2 absolviert. Zeit:",{"$f":"J67&B67&K67&C67&K67&L67&A67&K67&M67","v":"Fahrer Peter Bel mit der StartNr. 66 ,hat erfolgreich die Prüfung SP2 absolviert. Zeit:"},{"$f":"IF(ISERROR(H67),\"\",J67&B67&K67&C67&K67&L67&A67&K67&M67&K67&I67)","v":"Fahrer Peter Bel mit der StartNr. 66 ,hat erfolgreich die Prüfung SP2 absolviert. Zeit: -"},{"$f":"IF(ISERROR(H67),\"\",H67)","v":"00:00:00.800"},{"$f":"IF(P67=\"\",\"\",1)","v":1}]
[67," Thomas","Mirau",67,"00:00:08,56","00:00:01.40","00:00:08.560","00:00:00.560","","Fahrer"," ","mit der StartNr. ",",hat erfolgreich die Prüfung SP2 absolviert. Zeit:","Fahrer Thomas Mirau mit der StartNr. 67 ,hat erfolgreich die Prüfung SP2 absolviert. Zeit:","Fahrer Thomas Mirau mit der StartNr. 67 ,hat erfolgreich die Prüfung SP2 absolviert. Zeit: ","00:00:00.560",1]
[68," Markus","Gotta",68,"00:00:09,69","00:00:01.69","00:00:09.690","00:00:01.690","","Fahrer"," ","mit der StartNr. ",",hat erfolgreich die Prüfung SP2 absolviert. Zeit:","Fahrer Markus Gotta mit der StartNr. 68 ,hat erfolgreich die Prüfung SP2 absolviert. Zeit:","Fahrer Markus Gotta mit der StartNr. 68 ,hat erfolgreich die Prüfung SP2 absolviert. Zeit: ","00:00:01.690",1]
[69," Robin","Keulertz",69,"Keine Zeit","———","00:00:07.660","00:00:00.340","-","Fahrer"," ","mit der StartNr. ",",hat erfolgreich die Prüfung SP2 absolviert. Zeit:","Fahrer Robin Keulertz mit der StartNr. 69 ,hat erfolgreich die Prüfung SP2 absolviert. Zeit:","Fahrer Robin Keulertz mit der StartNr. 69 ,hat erfolgreich die Prüfung SP2 absolviert. Zeit: -","00:00:00.340",1]
[70," Christian","Häp",70,"Keine Zeit","———","00:00:08.970","00:00:00.970","","Fahrer"," ","mit der StartNr. ",",hat erfolgreich die Prüfung SP2 absolviert. Zeit:","Fahrer Christian Häp mit der StartNr. 70 ,hat erfolgreich die Prüfung SP2 absolviert. Zeit:","Fahrer Christian Häp mit der StartNr. 70 ,hat erfolgreich die Prüfung SP2 absolviert. Zeit: ","00:00:00.970",1]
[71," Ingolf","Zschockelt",71,"00:00:08,62","00:00:01.69","00:00:08.620","00:00:00.620","","Fahrer"," ","mit der StartNr. ",",hat erfolgreich die Prüfung SP2 absolviert. Zeit:","Fahrer Ingolf Zschockelt mit der StartNr. 71 ,hat erfolgreich die Prüfung SP2 absolviert. Zeit:","Fahrer Ingolf Zschockelt mit der StartNr. 71 ,hat erfolgreich die Prüfung SP2 absolviert. Zeit: ","00:00:00.620",1]
[72," Michael","Barsties",72,"Keine Zeit","———","00:00:10.490","00:00:02.490","","Fahrer"," ","mit der StartNr. ",",hat erfolgreich die Prüfung SP2 absolviert. Zeit:","Fahrer Michael Barsties mit der StartNr. 72 ,hat erfolgreich die Prüfung SP2 absolviert. Zeit:","Fahrer Michael Barsties mit der StartNr. 72 ,hat erfolgreich die Prüfung SP2 absolviert. Zeit: ","00:00:02.490",1]
[73," Ramona","Wagner",73,"00:00:08,90","00:00:01.69","00:00:08.900","00:00:00.900","","Fahrer"," ","mit der StartNr. ",",hat erfolgreich die Prüfung SP2 absolviert. Zeit:","Fahrer Ramona Wagner mit der StartNr. 73 ,hat erfolgreich die Prüfung SP2 absolviert. Zeit:","Fahrer Ramona Wagner mit der StartNr. 73 ,hat erfolgreich die Prüfung SP2 absolviert. Zeit: ","00:00:00.900",1]
[74," Lars","Fahrenbach",74,"00:00:07,89","00:00:00.11","00:00:07.890","00:00:00.110","-","Fahrer"," ","mit der StartNr. ",",hat erfolgreich die Prüfung SP2 absolviert. Zeit:","Fahrer Lars Fahrenbach mit der StartNr. 74 ,hat erfolgreich die Prüfung SP2 absolviert. Zeit:","Fahrer Lars Fahrenbach mit der StartNr. 74 ,hat erfolgreich die Prüfung SP2 absolviert. Zeit: -","00:00:00.110",1]
[75," Frank","Hoefnagels",75,"00:00:08,11","00:00:00.11","00:00:08.110","00:00:00.110","","Fahrer"," ","mit der StartNr. ",",hat erfolgreich die Prüfung SP2 absolviert. Zeit:","Fahrer Frank Hoefnagels mit der StartNr. 75 ,hat erfolgreich die Prüfung SP2 absolviert. Zeit:","Fahrer Frank Hoefnagels mit der StartNr. 75 ,hat erfolgreich die Prüfung SP2 absolviert. Zeit: ","00:00:00.110",1]
[76," Michael","Karch",76,"Keine Zeit","———","00:00:08.580","00:00:00.580","","Fahrer"," ","mit der StartNr. ",",hat erfolgreich die Prüfung SP2 absolviert. Zeit:","Fahrer Michael Karch mit der StartNr. 76 ,hat erfolgreich die Prüfung SP2 absolviert. Zeit:","Fahrer Michael Karch mit der StartNr. 76 ,hat erfolgreich die Prüfung SP2 absolviert. Zeit: ","00:00:00.580",1]
[77," Dirk","Götze",77,"00:00:08,92","00:00:00.11","00:00:08.920","00:00:00.920","","Fahrer"," ","mit der StartNr. ",",hat erfolgreich die Prüfung SP2 absolviert. Zeit:","Fahrer Dirk Götze mit der StartNr. 77 ,hat erfolgreich die Prüfung SP2 absolviert. Zeit:","Fahrer Dirk Götze mit der StartNr. 77 ,hat erfolgreich die Prüfung SP2 absolviert. Zeit: ","00:00:00.920",1]
[78," Stefan","Hillers",78,"Keine Zeit","———","00:00:09.990","00:00:01.990","","Fahrer"," ","mit der StartNr. ",",hat erfolgreich die Prüfung SP2 absolviert. Zeit:","Fahrer Stefan Hillers mit der StartNr. 78 ,hat erfolgreich die Prüfung SP2 absolviert. Zeit:","Fahrer Stefan Hillers mit der StartNr. 78 ,hat erfolgreich die Prüfung SP2 absolviert. Zeit: ","00:00:01.990",1]
[79," Christian","Rafflenbeul",79,"00:00:09,07","00:00:01.07","00:00:09.070","00:00:01.070","","Fahrer"," ","mit der StartNr. ",",hat erfolgreich die Prüfung SP2 absolviert. Zeit:","Fahrer Christian Rafflenbeul mit der StartNr. 79 ,hat erfolgreich die Prüfung SP2 absolviert. Zeit:","Fahrer Christian Rafflenbeul mit der StartNr. 79 ,hat erfolgreich die Prüfung SP2 absolviert. Zeit: ","00:00:01.070",1]
[80," Gerhard","Reuschel",80,"00:00:09,46","00:00:01.46","00:00:09.460","00:00:01.460","","Fahrer"," ","mit der StartNr. ",",hat erfolgreich die Prüfung SP2 absolviert. Zeit:","Fahrer Gerhard Reuschel mit der StartNr. 80 ,hat erfolgreich die Prüfung SP2 absolviert. Zeit:","Fahrer Gerhard Reuschel mit der StartNr. 80 ,hat erfolgreich die Prüfung SP2 absolviert. Zeit: ","00:00:01.460",1]
[81," Karsten","Rachow",81,"00:00:07,71","00:00:00.29","00:00:07.710","00:00:00.290","-","Fahrer"," ","mit der StartNr. ",",hat erfolgreich die Prüfung SP2 absolviert. Zeit:","Fahrer Karsten Rachow mit der StartNr. 81 ,hat erfolgreich die Prüfung SP2 absolviert. Zeit:","Fahrer Karsten Rachow mit der StartNr. 81 ,hat erfolgreich die Prüfung SP2 absolviert. Zeit: -","00:00:00.290",1]
[82," Jürgen","Ziller",82,"Keine Zeit","———",null,null,"-","Fahrer"," ","mit der StartNr. ",",hat erfolgreich die Prüfung SP2 absolviert. Zeit:","Fahrer Jürgen Ziller mit der StartNr. 82 ,hat erfolgreich die Prüfung SP2 absolviert. Zeit:",null,null,""]
[83," Alexander","Weil",83,"Keine Zeit","———","00:00:10.320","00:00:02.320","","Fahrer"," ","mit der StartNr. ",",hat erfolgreich die Prüfung SP2 absolviert. Zeit:","Fahrer Alexander Weil mit der StartNr. 83 ,hat erfolgreich die Prüfung SP2 absolviert. Zeit:","Fahrer Alexander Weil mit der StartNr. 83 ,hat erfolgreich die Prüfung SP2 absolviert. Zeit: ","00:00:02.320",1]
[84," Josef","Lindenberger",84,"Keine Zeit","———","00:00:13.120","00:00:05.120","","Fahrer"," ","mit der StartNr. ",",hat erfolgreich die Prüfung SP2 absolviert. Zeit:","Fahrer Josef Lindenberger mit der StartNr. 84 ,hat erfolgreich die Prüfung SP2 absolviert. Zeit:","Fahrer Josef Lindenberger mit der StartNr. 84 ,hat erfolgreich die Prüfung SP2 absolviert. Zeit: ","00:00:05.120",1]
[85," Rick","Durante",85,"Keine Zeit","———","00:00:08.740","00:00:00.740","","Fahrer"," ","mit der StartNr. ",",hat erfolgreich die Prüfung SP2 absolviert. Zeit:","Fahrer Rick Durante mit der StartNr. 85 ,hat erfolgreich die Prüfung SP2 absolviert. Zeit:","Fahrer Rick Durante mit der StartNr. 85 ,hat erfolgreich die Prüfung SP2 absolviert. Zeit: ","00:00:00.740",1]
[86," Almuth","Siemann",86,"Keine Zeit","———","00:00:09.650","00:00:01.650","","Fahrer"," ","mit der StartNr. ",",hat erfolgreich die Prüfung SP2 absolviert. Zeit:","Fahrer Almuth Siemann mit der StartNr. 86 ,hat erfolgreich die Prüfung SP2 absolviert. Zeit:","Fahrer Almuth Siemann mit der StartNr. 86 ,hat erfolgreich die Prüfung SP2 absolviert. Zeit: ","00:00:01.650",1]
[87," Axel","Strigl",87,"Keine Zeit","———","00:00:14.750","00:00:06.750","","Fahrer"," ","mit der StartNr. ",",hat erfolgreich die Prüfung SP2 absolviert. Zeit:","Fahrer Axel Strigl mit der StartNr. 87 ,hat erfolgreich die Prüfung SP2 absolviert. Zeit:","Fahrer Axel Strigl mit der StartNr. 87 ,hat erfolgreich die Prüfung SP2 absolviert. Zeit: ","00:00:06.750",1]
[88," Philip","Sommer",88,"00:00:08,36","00:00:00.29","00:00:08.360","00:00:00.360","","Fahrer"," ","mit der StartNr. ",",hat erfolgreich die Prüfung SP2 absolviert. Zeit:","Fahrer Philip Sommer mit der StartNr. 88 ,hat erfolgreich die Prüfung SP2 absolviert. Zeit:","Fahrer Philip Sommer mit der StartNr. 88 ,hat erfolgreich die Prüfung SP2 absolviert. Zeit: ","00:00:00.360",1]
[89," Jörg","Diehl",89,"00:00:09,02","00:00:01.02","00:00:09.020","00:00:01.020","","Fahrer"," ","mit der StartNr. ",",hat erfolgreich die Prüfung SP2 absolviert. Zeit:","Fahrer Jörg Diehl mit der StartNr. 89 ,hat erfolgreich die Prüfung SP2 absolviert. Zeit:","Fahrer Jörg Diehl mit der StartNr. 89 ,hat erfolgreich die Prüfung SP2 absolviert. Zeit: ","00:00:01.020",1]
[90," Matthias","Herzig",90,"00:00:09,47","00:00:01.47","00:00:09.470","00:00:01.470","","Fahrer"," ","mit der StartNr. ",",hat erfolgreich die Prüfung SP2 absolviert. Zeit:","Fahrer Matthias Herzig mit der StartNr. 90 ,hat erfolgreich die Prüfung SP2 absolviert. Zeit:","Fahrer Matthias Herzig mit der StartNr. 90 ,hat erfolgreich die Prüfung SP2 absolviert. Zeit: ","00:00:01.470",1]
[91," Christoph","Pasternak",91,"00:00:09,62","00:00:01.62","00:00:09.620","00:00:01.620","","Fahrer"," ","mit der StartNr. ",",hat erfolgreich die Prüfung SP2 absolviert. Zeit:","Fahrer Christoph Pasternak mit der StartNr. 91 ,hat erfolgreich die Prüfung SP2 absolviert. Zeit:","Fahrer Christoph Pasternak mit der StartNr. 91 ,hat erfolgreich die Prüfung SP2 absolviert. Zeit: ","00:00:01.620",1]
[92," Lothar","Schupet",92,"00:00:08,70","00:00:01.62","00:00:08.700","00:00:00.700","","Fahrer"," ","mit der StartNr. ",",hat erfolgreich die Prüfung SP2 absolviert. Zeit:","Fahrer Lothar Schupet mit der StartNr. 92 ,hat erfolgreich die Prüfung SP2 absolviert. Zeit:","Fahrer Lothar Schupet mit der StartNr. 92 ,hat erfolgreich die Prüfung SP2 absolviert. Zeit: ","00:00:00.700",1]
[93," Wolfgang","Schertler",93,"Keine Zeit","———","00:00:07.710","00:00:00.290","-","Fahrer"," ","mit der StartNr. ",",hat erfolgreich die Prüfung SP2 absolviert. Zeit:","Fahrer Wolfgang Schertler mit der StartNr. 93 ,hat erfolgreich die Prüfung SP2 absolviert. Zeit:","Fahrer Wolfgang Schertler mit der StartNr. 93 ,hat erfolgreich die Prüfung SP2 absolviert. Zeit: -","00:00:00.290",1]
[94," Thomas","Katzensteiner",94,"00:00:09,56","00:00:01.56","00:00:09.560","00:00:01.560","","Fahrer"," ","mit der StartNr. ",",hat erfolgreich die Prüfung SP2 absolviert. Zeit:","Fahrer Thomas Katzensteiner mit der StartNr. 94 ,hat erfolgreich die Prüfung SP2 absolviert. Zeit:","Fahrer Thomas Katzensteiner mit der StartNr. 94 ,hat erfolgreich die Prüfung SP2 absolviert. Zeit: ","00:00:01.560",1]
[95," Hagen","Hackenberg",95,"00:00:08,02","00:00:01.56","00:00:08.020","00:00:00.020","","Fahrer"," ","mit der StartNr. ",",hat erfolgreich die Prüfung SP2 absolviert. Zeit:","Fahrer Hagen Hackenberg mit der StartNr. 95 ,hat erfolgreich die Prüfung SP2 absolviert. Zeit:","Fahrer Hagen Hackenberg mit der StartNr. 95 ,hat erfolgreich die Prüfung SP2 absolviert. Zeit: ","00:00:00.020",1]
[96," Oliver","Dietz",96,"00:00:08,56","00:00:01.56","00:00:08.560","00:00:00.560","","Fahrer"," ","mit der StartNr. ",",hat erfolgreich die Prüfung SP2 absolviert. Zeit:","Fahrer Oliver Dietz mit der StartNr. 96 ,hat erfolgreich die Prüfung SP2 absolviert. Zeit:","Fahrer Oliver Dietz mit der StartNr. 96 ,hat erfolgreich die Prüfung SP2 absolviert. Zeit: ","00:00:00.560",1]
[97," Horst","Kempf",97,"00:00:08,61","00:00:01.56","00:00:08.610","00:00:00.610","","Fahrer"," ","mit der StartNr. ",",hat erfolgreich die Prüfung SP2 absolviert. Zeit:","Fahrer Horst Kempf mit der StartNr. 97 ,hat erfolgreich die Prüfung SP2 absolviert. Zeit:","Fahrer Horst Kempf mit der StartNr. 97 ,hat erfolgreich die Prüfung SP2 absolviert. Zeit: ","00:00:00.610",1]
[98," Detlev","Pauer",98,"Keine Zeit","———","00:00:10.300","00:00:02.300","","Fahrer"," ","mit der StartNr. ",",hat erfolgreich die Prüfung SP2 absolviert. Zeit:","Fahrer Detlev Pauer mit der StartNr. 98 ,hat erfolgreich die Prüfung SP2 absolviert. Zeit:","Fahrer Detlev Pauer mit der StartNr. 98 ,hat erfolgreich die Prüfung SP2 absolviert. Zeit: ","00:00:02.300",1]
[99," Dirk","Velte",99,"00:00:08,30","00:00:01.56","00:00:08.300","00:00:00.300","","Fahrer"," ","mit der StartNr. ",",hat erfolgreich die Prüfung SP2 absolviert. Zeit:","Fahrer Dirk Velte mit der StartNr. 99 ,hat erfolgreich die Prüfung SP2 absolviert. Zeit:","Fahrer Dirk Velte mit der StartNr. 99 ,hat erfolgreich die Prüfung SP2 absolviert. Zeit: ","00:00:00.300",1]
[100," Thorsten","Krack",100,"Keine Zeit","———","00:00:07.320","00:00:00.680","-","Fahrer"," ","mit der StartNr. ",",hat erfolgreich die Prüfung SP2 absolviert. Zeit:","Fahrer Thorsten Krack mit der StartNr. 100 ,hat erfolgreich die Prüfung SP2 absolviert. Zeit:","Fahrer Thorsten Krack mit der StartNr. 100 ,hat erfolgreich die Prüfung SP2 absolviert. Zeit: -","00:00:00.680",1]
[101," Christian","Wittek",101,"00:00:08,48","00:00:01.56","00:00:08.480","00:00:00.480","","Fahrer"," ","mit der StartNr. ",",hat erfolgreich die Prüfung SP2 absolviert. Zeit:","Fahrer Christian Wittek mit der StartNr. 101 ,hat erfolgreich die Prüfung SP2 absolviert. Zeit:","Fahrer Christian Wittek mit der StartNr. 101 ,hat erfolgreich die Prüfung SP2 absolviert. Zeit: ","00:00:00.480",1]
[102," Benjamin","Hix",102,"Keine Zeit","———","00:00:08.600","00:00:00.600","","Fahrer"," ","mit der StartNr. ",",hat erfolgreich die Prüfung SP2 absolviert. Zeit:","Fahrer Benjamin Hix mit der StartNr. 102 ,hat erfolgreich die Prüfung SP2 absolviert. Zeit:","Fahrer Benjamin Hix mit der StartNr. 102 ,hat erfolgreich die Prüfung SP2 absolviert. Zeit: ","00:00:00.600",1]
[null,null,null,null,null,null,null,null,null,null,null,null,null,null,null,null,{"$f":"SUM(Q2:Q103)","v":99}]

{"sheet":"SP3","index":2,"n_rows":105,"n_cols":22,"rows_kept":105,"cut":false,"hidden":false,"merged":[]}
[null,null,null,null,null,null,null,null,null,"00:02:45"]
[null,null,null,"#","Start","Ziel","Fahrtzeit","Abweichung","Start","Ziel","Fahrzeit","Zeit","Diff.",null,null,null,null,null,null,"bitte auf das Vorzeichen \"-\" achten!","m:ss,00"]
[1," Christian","Jäger",1,"14:50:00,00","14:52:45,25","00:02:45,25","00:00:00,00",{"$f":"IF(E3=\"———\",\"\",E3)","v":"14:50:00,00"},{"$f":"IF(F3=\"———\",\"\",F3)","v":"14:52:45,25"},{"$f":"IF(G3=\"Keine Zeit\",\"\",G3)","v":"00:02:45,25"},{"$f":"IF(K3=\"\",\"\",J3-I3)","v":"00:02:45.250"},{"$f":"ABS(L3-$J$1)","v":"00:00:00.250"},{"$f":"IF(ISERROR(L3),\"\",IF(L3<=$J$1,\"-\",\"\"))","v":""},{"$f":"IF(K30>=J2,\"-\",\"\")","v":""},"Fahrer"," ","mit der StartNr. ",",hat erfolgreich die Prüfung SP3 absolviert. Zeit:",{"$f":"IF(ISERROR(M3),\"\",P3&B3&Q3&C3&Q3&R3&A3&Q3&S3&Q3&N3&Q3&Q3&O3)","v":"Fahrer Christian Jäger mit der StartNr. 1 ,hat erfolgreich die Prüfung SP3 absolviert. Zeit:   "},{"$f":"IF(ISERROR(M3),\"\",M3)","v":"00:00:00.250"},{"$f":"IF(U3=\"\",\"\",1)","v":1}]
[2," Daniel","Rinck",2,"14:51:00,00","14:53:45,51","00:02:45,51","00:00:00,00",{"$f":"IF(E4=\"———\",\"\",E4)","v":"14:51:00,00"},{"$f":"IF(F4=\"———\",\"\",F4)","v":"14:53:45,51"},{"$f":"IF(G4=\"Keine Zeit\",\"\",G4)","v":"00:02:45,51"},{"$f":"IF(K4=\"\",\"\",J4-I4)","v":"00:02:45.510"},"00:00:00.510","",{"$f":"IF(K31>=J3,\"-\",\"\")","v":""},"Fahrer"," ","mit der StartNr. ",",hat erfolgreich die Prüfung SP3 absolviert. Zeit:",{"$f":"IF(ISERROR(M4),\"\",P4&B4&Q4&C4&Q4&R4&A4&Q4&S4&Q4&N4 &Q4&Q4&O4)","v":"Fahrer Daniel Rinck mit der StartNr. 2 ,hat erfolgreich die Prüfung SP3 absolviert. Zeit:   "},{"$f":"IF(ISERROR(M4),\"\",M4)","v":"00:00:00.510"},1]
[3," Malte","Proff-Klein",3,"14:52:00,00","14:54:45,34","00:02:45,34","00:00:00,00","14:52:00,00",{"$f":"IF(F5=\"———\",\"\",F5)","v":"14:54:45,34"},{"$f":"IF(G5=\"Keine Zeit\",\"\",G5)","v":"00:02:45,34"},{"$f":"IF(K5=\"\",\"\",J5-I5)","v":"00:02:45.340"},"00:00:00.340",{"$f":"IF(ISERROR(L5),\"\",IF(L5<=$J$1,\"-\",\"\"))","v":""},{"$f":"IF(K32>=J4,\"-\",\"\")","v":""},"Fahrer"," ","mit der StartNr. ",",hat erfolgreich die Prüfung SP3 absolviert. Zeit:",{"$f":"IF(ISERROR(M5),\"\",P5&B5&Q5&C5&Q5&R5&A5&Q5&S5&Q5&N5 &Q5&Q5&O5)","v":"Fahrer Malte Proff-Klein mit der StartNr. 3 ,hat erfolgreich die Prüfung SP3 absolviert. Zeit:   "},"00:00:00.340",1]
[4," Dietmar","Siemssen",4,"14:53:00,00","14:55:46,02","00:02:46,02","00:00:01,02","14:53:00,00","14:55:46,02","00:02:46,02","00:02:46.020","00:00:01.020",{"$f":"IF(ISERROR(L6),\"\",IF(L6<=$J$1,\"-\",\"\"))","v":""},"","Fahrer"," ","mit der StartNr. ",",hat erfolgreich die Prüfung SP3 absolviert. Zeit:","Fahrer Dietmar Siemssen mit der StartNr. 4 ,hat erfolgreich die Prüfung SP3 absolviert. Zeit:   ","00:00:01.020",1]
[5," Franz-Michael","Hartmann",5,"14:53:30,00","14:55:59,78","00:02:29,78","00:00:15,22","14:53:30,00","14:55:59,78","00:02:29,78","00:02:29.780","00:00:15.220","-","","Fahrer"," ","mit der StartNr. ",",hat erfolgreich die Prüfung SP3 absolviert. Zeit:","Fahrer Franz-Michael Hartmann mit der StartNr. 5 ,hat erfolgreich die Prüfung SP3 absolviert. Zeit: -  ","00:00:15.220",1]
[6," Christoph","Schroer",6,"14:54:30,00","14:57:15,76","00:02:45,76","00:00:15,22","14:54:30,00","14:57:15,76","00:02:45,76","00:02:45.760","00:00:00.760","","","Fahrer"," ","mit der StartNr. ",",hat erfolgreich die Prüfung SP3 absolviert. Zeit:","Fahrer Christoph Schroer mit der StartNr. 6 ,hat erfolgreich die Prüfung SP3 absolviert. Zeit:   ","00:00:00.760",1]
[7," Jochen","Artzinger-Bolten",7,"14:55:00,00","14:58:11,11","00:03:11,11","00:00:26,11","14:55:00,00","14:58:11,11","00:03:11,11","00:03:11.110","00:00:26.110","","","Fahrer"," ","mit der StartNr. ",",hat erfolgreich die Prüfung SP3 absolviert. Zeit:","Fahrer Jochen Artzinger-Bolten mit der StartNr. 7 ,hat erfolgreich die Prüfung SP3 absolviert. Zeit:   ","00:00:26.110",1]
[8," Friedhelm","Eickhorn",8,"14:55:30,00","14:58:15,00","00:02:45,00","00:00:26,11","14:55:30,00","14:58:15,00","00:02:45,00","00:02:45","00:00:00","-","","Fahrer"," ","mit der StartNr. ",",hat erfolgreich die Prüfung SP3 absolviert. Zeit:","Fahrer Friedhelm Eickhorn mit der StartNr. 8 ,hat erfolgreich die Prüfung SP3 absolviert. Zeit: -  ","00:00:00",1]
[9," Carsten","Reblin",9,"14:56:30,00","14:59:15,97","00:02:45,97","00:00:26,11","14:56:30,00","14:59:15,97","00:02:45,97","00:02:45.970","00:00:00.970","","","Fahrer"," ","mit der StartNr. ",",hat erfolgreich die Prüfung SP3 absolviert. Zeit:","Fahrer Carsten Reblin mit der StartNr. 9 ,hat erfolgreich die Prüfung SP3 absolviert. Zeit:   ","00:00:00.970",1]
[10," Dieter","Dinges",10,"14:57:00,00","14:59:37,70","00:02:37,70","00:00:07,30","14:57:00,00","14:59:37,70","00:02:37,70","00:02:37.700","00:00:07.300","-","","Fahrer"," ","mit der StartNr. ",",hat erfolgreich die Prüfung SP3 absolviert. Zeit:","Fahrer Dieter Dinges mit der StartNr. 10 ,hat erfolgreich die Prüfung SP3 absolviert. Zeit: -  ","00:00:07.300",1]
[11," Wolfgang","Reeh",11,"14:58:00,00","15:00:43,78","00:02:43,78","00:00:01,22","14:58:00,00","15:00:43,78","00:02:43,78","00:02:43.780","00:00:01.220","-","","Fahrer"," ","mit der StartNr. ",",hat erfolgreich die Prüfung SP3 absolviert. Zeit:","Fahrer Wolfgang Reeh mit der StartNr. 11 ,hat erfolgreich die Prüfung SP3 absolviert. Zeit: -  ","00:00:01.220",1]
[12," Andreas","Petry",12,"14:58:30,00","15:01:05,13","00:02:35,13","00:00:09,87","14:58:30,00","15:01:05,13","00:02:35,13","00:02:35.130","00:00:09.870","-","","Fahrer"," ","mit der StartNr. ",",hat erfolgreich die Prüfung SP3 absolviert. Zeit:","Fahrer Andreas Petry mit der StartNr. 12 ,hat erfolgreich die Prüfung SP3 absolviert. Zeit: -  ","00:00:09.870",1]
[13," Ted","Prenzel",13,"14:59:00,00","15:01:45,10","00:02:45,10","00:00:09,87","14:59:00,00","15:01:45,10","00:02:45,10","00:02:45.100","00:00:00.100","","","Fahrer"," ","mit der StartNr. ",",hat erfolgreich die Prüfung SP3 absolviert. Zeit:","Fahrer Ted Prenzel mit der StartNr. 13 ,hat erfolgreich die Prüfung SP3 absolviert. Zeit:   ","00:00:00.100",1]
[14," Micha","Barsties",14,"14:59:30,00","15:02:09,31","00:02:39,31","00:00:05,69","14:59:30,00","15:02:09,31","00:02:39,31","00:02:39.310","00:00:05.690","-","","Fahrer"," ","mit der StartNr. ",",hat erfolgreich die Prüfung SP3 absolviert. Zeit:","Fahrer Micha Barsties mit der StartNr. 14 ,hat erfolgreich die Prüfung SP3 absolviert. Zeit: -  ","00:00:05.690",1]
[15," Klaus","Flettner",15,"———","———","Keine Zeit","———","","","","",{"$error":"#VALUE!"},"","","Fahrer"," ","mit der StartNr. ",",hat erfolgreich die Prüfung SP3 absolviert. Zeit:","","",""]
[16," Heinz","Frey",16,"15:00:00,00","15:02:46,86","00:02:46,86","00:00:01,86","15:00:00,00","15:02:46,86","00:02:46,86","00:02:46.860","00:00:01.860","","-","Fahrer"," ","mit der StartNr. ",",hat erfolgreich die Prüfung SP3 absolviert. Zeit:","Fahrer Heinz Frey mit der StartNr. 16 ,hat erfolgreich die Prüfung SP3 absolviert. Zeit:   -","00:00:01.860",1]
[17," Henning","Reichel",17,"15:00:30,00","15:03:15,82","00:02:45,82","00:00:01,86","15:00:30,00","15:03:15,82","00:02:45,82","00:02:45.820","00:00:00.820","","","Fahrer"," ","mit der StartNr. ",",hat erfolgreich die Prüfung SP3 absolviert. Zeit:","Fahrer Henning Reichel mit der StartNr. 17 ,hat erfolgreich die Prüfung SP3 absolviert. Zeit:   ","00:00:00.820",1]
[18," Maik","Käbisch",18,"15:01:00,00","15:03:45,08","00:02:45,08","00:00:01,86","15:01:00,00","15:03:45,08","00:02:45,08","00:02:45.080","00:00:00.080","","","Fahrer"," ","mit der StartNr. ",",hat erfolgreich die Prüfung SP3 absolviert. Zeit:","Fahrer Maik Käbisch mit der StartNr. 18 ,hat erfolgreich die Prüfung SP3 absolviert. Zeit:   ","00:00:00.080",1]
[19," Harald","Zapp",19,"15:02:00,00","15:04:44,90","00:02:44,90","00:00:00,10","15:02:00,00","15:04:44,90","00:02:44,90","00:02:44.900","00:00:00.100","-","","Fahrer"," ","mit der StartNr. ",",hat erfolgreich die Prüfung SP3 absolviert. Zeit:","Fahrer Harald Zapp mit der StartNr. 19 ,hat erfolgreich die Prüfung SP3 absolviert. Zeit: -  ","00:00:00.100",1]
[20," Reinhard","Grzesik",20,"15:03:30,00","15:06:16,34","00:02:46,34","00:00:01,34","15:03:30,00","15:06:16,34","00:02:46,34","00:02:46.340","00:00:01.340","","","Fahrer"," ","mit der StartNr. ",",hat erfolgreich die Prüfung SP3 absolviert. Zeit:","Fahrer Reinhard Grzesik mit der StartNr. 20 ,hat erfolgreich die Prüfung SP3 absolviert. Zeit:   ","00:00:01.340",1]
[21," Jörg","Sihler",21,"15:04:30,00","15:07:16,51","00:02:46,51","00:00:01,51","15:04:30,00","15:07:16,51","00:02:46,51","00:02:46.510","00:00:01.510","","","Fahrer"," ","mit der StartNr. ",",hat erfolgreich die Prüfung SP3 absolviert. Zeit:","Fahrer Jörg Sihler mit der StartNr. 21 ,hat erfolgreich die Prüfung SP3 absolviert. Zeit:   ","00:00:01.510",1]
[22," Ingo","Winterstein",22,"15:11:30,00","15:14:17,27","00:02:47,27","00:00:02,27","15:11:30,00","15:14:17,27","00:02:47,27","00:02:47.270","00:00:02.270","","","Fahrer"," ","mit der StartNr. ",",hat erfolgreich die Prüfung SP3 absolviert. Zeit:","Fahrer Ingo Winterstein mit der StartNr. 22 ,hat erfolgreich die Prüfung SP3 absolviert. Zeit:   ","00:00:02.270",1]
[23," Hans Werner","Melchior",23,"15:03:00,00","15:05:45,01","00:02:45,01","00:00:02,27","15:03:00,00","15:05:45,01","00:02:45,01","00:02:45.010","00:00:00.010","","","Fahrer"," ","mit der StartNr. ",",hat erfolgreich die Prüfung SP3 absolviert. Zeit:","Fahrer Hans Werner Melchior mit der StartNr. 23 ,hat erfolgreich die Prüfung SP3 absolviert. Zeit:   ","00:00:00.010",1]
[24," Marco","Oriolo",24,"15:55:00,00","15:57:58,31","00:02:58,31","00:00:13,31","15:55:00,00","15:57:58,31","00:02:58,31","00:02:58.310","00:00:13.310","","","Fahrer"," ","mit der StartNr. ",",hat erfolgreich die Prüfung SP3 absolviert. Zeit:","Fahrer Marco Oriolo mit der StartNr. 24 ,hat erfolgreich die Prüfung SP3 absolviert. Zeit:   ","00:00:13.310",1]
[25," Manfred","Stommel",25,"15:02:30,00","15:05:14,99","00:02:44,99","00:00:00,01","15:02:30,00","15:05:14,99","00:02:44,99","00:02:44.990","00:00:00.010","-","","Fahrer"," ","mit der StartNr. ",",hat erfolgreich die Prüfung SP3 absolviert. Zeit:","Fahrer Manfred Stommel mit der StartNr. 25 ,hat erfolgreich die Prüfung SP3 absolviert. Zeit: -  ","00:00:00.010",1]
[26," Carolin","Heusel",26,"15:13:30,00","15:16:15,65","00:02:45,65","00:00:00,01","15:13:30,00","15:16:15,65","00:02:45,65","00:02:45.650","00:00:00.650","","","Fahrer"," ","mit der StartNr. ",",hat erfolgreich die Prüfung SP3 absolviert. Zeit:","Fahrer Carolin Heusel mit der StartNr. 26 ,hat erfolgreich die Prüfung SP3 absolviert. Zeit:   ","00:00:00.650",1]
[27," Regina","Philippi",27,"15:14:30,00","15:17:52,92","00:03:22,92","00:00:37,92","15:14:30,00","15:17:52,92","00:03:22,92","00:03:22.920","00:00:37.920","","","Fahrer"," ","mit der StartNr. ",",hat erfolgreich die Prüfung SP3 absolviert. Zeit:","Fahrer Regina Philippi mit der StartNr. 27 ,hat erfolgreich die Prüfung SP3 absolviert. Zeit:   ","00:00:37.920",1]
[28," Christof","Aha",28,"15:06:00,00","15:08:34,19","00:02:34,19","00:00:10,81","15:06:00,00","15:08:34,19","00:02:34,19","00:02:34.190","00:00:10.810","-","","Fahrer"," ","mit der StartNr. ",",hat erfolgreich die Prüfung SP3 absolviert. Zeit:","Fahrer Christof Aha mit der StartNr. 28 ,hat erfolgreich die Prüfung SP3 absolviert. Zeit: -  ","00:00:10.810",1]
[29," Dennis","Weiss",29,"15:28:30,00","15:31:13,22","00:02:43,22","00:00:01,78","15:28:30,00","15:31:13,22","00:02:43,22","00:02:43.220","00:00:01.780","-","","Fahrer"," ","mit der StartNr. ",",hat erfolgreich die Prüfung SP3 absolviert. Zeit:","Fahrer Dennis Weiss mit der StartNr. 29 ,hat erfolgreich die Prüfung SP3 absolviert. Zeit: -  ","00:00:01.780",1]
[30," Harald","Hamprecht",30,"15:33:00,00","15:35:45,76","00:02:45,76","00:00:01,78","15:33:00,00","15:35:45,76","00:02:45,76","00:02:45.760","00:00:00.760","","","Fahrer"," ","mit der StartNr. ",",hat erfolgreich die Prüfung SP3 absolviert. Zeit:","Fahrer Harald Hamprecht mit der StartNr. 30 ,hat erfolgreich die Prüfung SP3 absolviert. Zeit:   ","00:00:00.760",1]
[31," Reno","Fiolic",31,"15:08:00,00","15:10:18,42","00:02:18,42","00:00:26,58","15:08:00,00","15:10:18,42","00:02:18,42","00:02:18.420","00:00:26.580","-","","Fahrer"," ","mit der StartNr. ",",hat erfolgreich die Prüfung SP3 absolviert. Zeit:","Fahrer Reno Fiolic mit der StartNr. 31 ,hat erfolgreich die Prüfung SP3 absolviert. Zeit: -  ","00:00:26.580",1]
[32," Jürgen","Kulpe",32,"15:12:30,00","15:15:16,45","00:02:46,45","00:00:01,45","15:12:30,00","15:15:16,45","00:02:46,45","00:02:46.450","00:00:01.450","","","Fahrer"," ","mit der StartNr. ",",hat erfolgreich die Prüfung SP3 absolviert. Zeit:","Fahrer Jürgen Kulpe mit der StartNr. 32 ,hat erfolgreich die Prüfung SP3 absolviert. Zeit:   ","00:00:01.450",1]
[33," Konstantin","Kovarbasic",33,"15:05:30,00","15:08:03,47","00:02:33,47","00:00:11,53","15:05:30,00","15:08:03,47","00:02:33,47","00:02:33.470",{"$f":"ABS(L35-$J$1)","v":"00:00:11.530"},"-","","Fahrer"," ","mit der StartNr. ",",hat erfolgreich die Prüfung SP3 absolviert. Zeit:","Fahrer Konstantin Kovarbasic mit der StartNr. 33 ,hat erfolgreich die Prüfung SP3 absolviert. Zeit: -  ","00:00:11.530",1]
[34," Nikolaus","Kratz",34,"15:13:00,00","15:15:46,14","00:02:46,14","00:00:01,14","15:13:00,00","15:15:46,14","00:02:46,14","00:02:46.140","00:00:01.140","","","Fahrer"," ","mit der StartNr. ",",hat erfolgreich die Prüfung SP3 absolviert. Zeit:","Fahrer Nikolaus Kratz mit der StartNr. 34 ,hat erfolgreich die Prüfung SP3 absolviert. Zeit:   ","00:00:01.140",1]
[35," Andreas","Eberhardt",35,"15:15:00,00","15:17:54,57","00:02:54,57","00:00:09,57","15:15:00,00","15:17:54,57","00:02:54,57","00:02:54.570","00:00:09.570","","","Fahrer"," ","mit der StartNr. ",",hat erfolgreich die Prüfung SP3 absolviert. Zeit:","Fahrer Andreas Eberhardt mit der StartNr. 35 ,hat erfolgreich die Prüfung SP3 absolviert. Zeit:   ","00:00:09.570",1]
[36," Gerhard","Thomas",36,"15:10:00","15:12:44,84","00:56:44,84","00:06:00,16","15:10:00","15:12:44,84","00:56:44,84","00:02:44.840","00:00:00.160","-","","Fahrer"," ","mit der StartNr. ",",hat erfolgreich die Prüfung SP3 absolviert. Zeit:","Fahrer Gerhard Thomas mit der StartNr. 36 ,hat erfolgreich die Prüfung SP3 absolviert. Zeit: -  ","00:00:00.160",1]
[37," Lotzi","Kende",37,"15:08:30,00","15:11:15,32","00:02:45,32","00:06:00,16","15:08:30,00","15:11:15,32","00:02:45,32","00:02:45.320","00:00:00.320","","","Fahrer"," ","mit der StartNr. ",",hat erfolgreich die Prüfung SP3 absolviert. Zeit:","Fahrer Lotzi Kende mit der StartNr. 37 ,hat erfolgreich die Prüfung SP3 absolviert. Zeit:   ","00:00:00.320",1]
[38," Jockel","Winkelhock",38,"———","———","Keine Zeit","———","","","","",{"$error":"#VALUE!"},"","","Fahrer"," ","mit der StartNr. ",",hat erfolgreich die Prüfung SP3 absolviert. Zeit:","","",""]
[39," Sascha","Wilkesmann",39,"15:14:00,00","15:16:49,57","00:02:49,57","00:00:04,57","15:14:00,00","15:16:49,57","00:02:49,57","00:02:49.570","00:00:04.570","","-","Fahrer"," ","mit der StartNr. ",",hat erfolgreich die Prüfung SP3 absolviert. Zeit:","Fahrer Sascha Wilkesmann mit der StartNr. 39 ,hat erfolgreich die Prüfung SP3 absolviert. Zeit:   -","00:00:04.570",1]
[40," Gregor","Schulz",40,"15:35:00,00","15:38:19,23","00:03:19,23","00:00:34,23","15:35:00,00","15:38:19,23","00:03:19,23","00:03:19.230","00:00:34.230","","","Fahrer"," ","mit der StartNr. ",",hat erfolgreich die Prüfung SP3 absolviert. Zeit:","Fahrer Gregor Schulz mit der StartNr. 40 ,hat erfolgreich die Prüfung SP3 absolviert. Zeit:   ","00:00:34.230",1]
[41," Peer","Hildmann",41,"15:07:00,00","15:10:15,41","00:03:15,41","00:00:30,41","15:07:00,00","15:10:15,41","00:03:15,41","00:03:15.410","00:00:30.410","","","Fahrer"," ","mit der StartNr. ",",hat erfolgreich die Prüfung SP3 absolviert. Zeit:","Fahrer Peer Hildmann mit der StartNr. 41 ,hat erfolgreich die Prüfung SP3 absolviert. Zeit:   ","00:00:30.410",1]
[42," Mina","Tander",42,"———","———","Keine Zeit","———","","","","",{"$error":"#VALUE!"},"","","Fahrer"," ","mit der StartNr. ",",hat erfolgreich die Prüfung SP3 absolviert. Zeit:","","",""]
[43," Stefan","Iskan",43,"16:24:30,00","16:27:30,57","00:03:00,57","00:00:15,57","16:24:30,00","16:27:30,57","00:03:00,57","00:03:00.570","00:00:15.570","","-","Fahrer"," ","mit der StartNr. ",",hat erfolgreich die Prüfung SP3 absolviert. Zeit:","Fahrer Stefan Iskan mit der StartNr. 43 ,hat erfolgreich die Prüfung SP3 absolviert. Zeit:   -","00:00:15.570",1]
[44," Jean-Philippe","Kempf",44,"15:29:30,00","15:32:04,50","00:02:34,50","00:00:10,50","15:29:30,00","15:32:04,50","00:02:34,50","00:02:34.500","00:00:10.500","-","","Fahrer"," ","mit der StartNr. ",",hat erfolgreich die Prüfung SP3 absolviert. Zeit:","Fahrer Jean-Philippe Kempf mit der StartNr. 44 ,hat erfolgreich die Prüfung SP3 absolviert. Zeit: -  ","00:00:10.500",1]
[45," Daniel","Martin",45,"15:18:00,00","15:20:45,39","00:02:45,39","00:00:10,50","15:18:00,00","15:20:45,39","00:02:45,39","00:02:45.390","00:00:00.390","","","Fahrer"," ","mit der StartNr. ",",hat erfolgreich die Prüfung SP3 absolviert. Zeit:","Fahrer Daniel Martin mit der StartNr. 45 ,hat erfolgreich die Prüfung SP3 absolviert. Zeit:   ","00:00:00.390",1]
[46," Elena","Funk",46,"16:13:00,00","16:15:45,19","00:02:45,19","00:00:10,50","16:13:00,00","16:15:45,19","00:02:45,19","00:02:45.190","00:00:00.190","","","Fahrer"," ","mit der StartNr. ",",hat erfolgreich die Prüfung SP3 absolviert. Zeit:","Fahrer Elena Funk mit der StartNr. 46 ,hat erfolgreich die Prüfung SP3 absolviert. Zeit:   ","00:00:00.190",1]
[47," Hans","Mutschall",47,"15:16:00,00","15:18:45,16","00:02:45,16","00:00:10,50","15:16:00,00","15:18:45,16","00:02:45,16","00:02:45.160","00:00:00.160","","","Fahrer"," ","mit der StartNr. ",",hat erfolgreich die Prüfung SP3 absolviert. Zeit:","Fahrer Hans Mutschall mit der StartNr. 47 ,hat erfolgreich die Prüfung SP3 absolviert. Zeit:   ","00:00:00.160",1]
[48," Kahled","Rahman",48,"15:17:00,00","15:19:46,04","00:02:46,04","00:00:01,04","15:17:00,00","15:19:46,04","00:02:46,04","00:02:46.040","00:00:01.040","","","Fahrer"," ","mit der StartNr. ",",hat erfolgreich die Prüfung SP3 absolviert. Zeit:","Fahrer Kahled Rahman mit der StartNr. 48 ,hat erfolgreich die Prüfung SP3 absolviert. Zeit:   ","00:00:01.040",1]
[49," Jochen","Schwarz",49,"15:19:30,00","15:22:15,45","00:02:45,45","00:00:01,04","15:19:30,00","15:22:15,45","00:02:45,45","00:02:45.450","00:00:00.450","","","Fahrer"," ","mit der StartNr. ",",hat erfolgreich die Prüfung SP3 absolviert. Zeit:","Fahrer Jochen Schwarz mit der StartNr. 49 ,hat erfolgreich die Prüfung SP3 absolviert. Zeit:   ","00:00:00.450",1]
[50," Axel","Nawrath",50,"———","———","Keine Zeit","———","","","","",{"$error":"#VALUE!"},"","","Fahrer"," ","mit der StartNr. ",",hat erfolgreich die Prüfung SP3 absolviert. Zeit:","","",""]
[51," Birgit","Claussen",51,"15:27:00,00","15:29:42,59","00:02:42,59","00:00:02,41","15:27:00,00","15:29:42,59","00:02:42,59","00:02:42.590","00:00:02.410","-","-","Fahrer"," ","mit der StartNr. ",",hat erfolgreich die Prüfung SP3 absolviert. Zeit:","Fahrer Birgit Claussen mit der StartNr. 51 ,hat erfolgreich die Prüfung SP3 absolviert. Zeit: -  -","00:00:02.410",1]
[52," Harald","König",52,"15:31:00,00","15:33:46,64","00:02:46,64","00:00:01,64","15:31:00,00","15:33:46,64","00:02:46,64","00:02:46.640","00:00:01.640","","","Fahrer"," ","mit der StartNr. ",",hat erfolgreich die Prüfung SP3 absolviert. Zeit:","Fahrer Harald König mit der StartNr. 52 ,hat erfolgreich die Prüfung SP3 absolviert. Zeit:   ","00:00:01.640",1]
[53," Thomas","Blank",53,"15:26:00,00","15:28:43,24","00:02:43,24","00:00:01,76","15:26:00,00","15:28:43,24","00:02:43,24","00:02:43.240","00:00:01.760","-","","Fahrer"," ","mit der StartNr. ",",hat erfolgreich die Prüfung SP3 absolviert. Zeit:","Fahrer Thomas Blank mit der StartNr. 53 ,hat erfolgreich die Prüfung SP3 absolviert. Zeit: -  ","00:00:01.760",1]
[54," Heidi","Eberhardt",54,"15:47:00,00","15:50:12,48","00:03:12,48","00:00:27,48","15:47:00,00","15:50:12,48","00:03:12,48","00:03:12.480","00:00:27.480","","","Fahrer"," ","mit der StartNr. ",",hat erfolgreich die Prüfung SP3 absolviert. Zeit:","Fahrer Heidi Eberhardt mit der StartNr. 54 ,hat erfolgreich die Prüfung SP3 absolviert. Zeit:   ","00:00:27.480",1]
[55," Karina","Ansos",55,"15:27:30,00","15:30:14,60","00:02:44,60","00:00:00,40","15:27:30,00","15:30:14,60","00:02:44,60","00:02:44.600","00:00:00.400","-","","Fahrer"," ","mit der StartNr. ",",hat erfolgreich die Prüfung SP3 absolviert. Zeit:","Fahrer Karina Ansos mit der StartNr. 55 ,hat erfolgreich die Prüfung SP3 absolviert. Zeit: -  ","00:00:00.400",1]
[56," Michael","Gotta",56,"15:23:00,00","15:25:49,03","00:02:49,03","00:00:04,03","15:23:00,00","15:25:49,03","00:02:49,03","00:02:49.030","00:00:04.030","","","Fahrer"," ","mit der StartNr. ",",hat erfolgreich die Prüfung SP3 absolviert. Zeit:","Fahrer Michael Gotta mit der StartNr. 56 ,hat erfolgreich die Prüfung SP3 absolviert. Zeit:   ","00:00:04.030",1]
[57," Stefanie","Rinck",57,"15:51:00,00","15:53:45,33","00:02:45,33","00:00:04,03","15:51:00,00","15:53:45,33","00:02:45,33","00:02:45.330","00:00:00.330","","","Fahrer"," ","mit der StartNr. ",",hat erfolgreich die Prüfung SP3 absolviert. Zeit:","Fahrer Stefanie Rinck mit der StartNr. 57 ,hat erfolgreich die Prüfung SP3 absolviert. Zeit:   ","00:00:00.330",1]
[58," Armin","Slotta",58,"15:36:00,00","15:38:34,12","00:02:34,12","00:00:10,88","15:36:00,00","15:38:34,12","00:02:34,12","00:02:34.120","00:00:10.880","-","","Fahrer"," ","mit der StartNr. ",",hat erfolgreich die Prüfung SP3 absolviert. Zeit:","Fahrer Armin Slotta mit der StartNr. 58 ,hat erfolgreich die Prüfung SP3 absolviert. Zeit: -  ","00:00:10.880",1]
[59," Julia","Kende",59,"15:57:00,00","15:59:46,33","00:02:46,33","00:00:01,33","15:57:00,00","15:59:46,33","00:02:46,33","00:02:46.330","00:00:01.330","","","Fahrer"," ","mit der StartNr. ",",hat erfolgreich die Prüfung SP3 absolviert. Zeit:","Fahrer Julia Kende mit der StartNr. 59 ,hat erfolgreich die Prüfung SP3 absolviert. Zeit:   ","00:00:01.330",1]
[60," Robert","Bleckmann",60,"15:34:00,00","15:36:46,83","00:02:46,83","00:00:01,83","15:34:00,00","15:36:46,83","00:02:46,83","00:02:46.830","00:00:01.830","","","Fahrer"," ","mit der StartNr. ",",hat erfolgreich die Prüfung SP3 absolviert. Zeit:","Fahrer Robert Bleckmann mit der StartNr. 60 ,hat erfolgreich die Prüfung SP3 absolviert. Zeit:   ","00:00:01.830",1]
[61," Christof","Harwardt",61,"15:31:30,00","15:35:22,07","00:03:52,07","00:01:07,07","15:31:30,00","15:35:22,07","00:03:52,07","00:03:52.070","00:01:07.070","","","Fahrer"," ","mit der StartNr. ",",hat erfolgreich die Prüfung SP3 absolviert. Zeit:","Fahrer Christof Harwardt mit der StartNr. 61 ,hat erfolgreich die Prüfung SP3 absolviert. Zeit:   ","00:01:07.070",1]
[62," Thomas","Kahns",62,"16:02:00,00","16:04:44,97","00:02:44,97","00:00:00,03","16:02:00,00","16:04:44,97","00:02:44,97","00:02:44.970","00:00:00.030","-","","Fahrer"," ","mit der StartNr. ",",hat erfolgreich die Prüfung SP3 absolviert. Zeit:","Fahrer Thomas Kahns mit der StartNr. 62 ,hat erfolgreich die Prüfung SP3 absolviert. Zeit: -  ","00:00:00.030",1]
[63," Maximilian","Herbst",63,"15:25:00,00","15:27:45,01","00:02:45,01","00:00:00,03","15:25:00,00","15:27:45,01","00:02:45,01","00:02:45.010","00:00:00.010","","","Fahrer"," ","mit der StartNr. ",",hat erfolgreich die Prüfung SP3 absolviert. Zeit:","Fahrer Maximilian Herbst mit der StartNr. 63 ,hat erfolgreich die Prüfung SP3 absolviert. Zeit:   ","00:00:00.010",1]
[64," Jürgen","Buchhold",64,"15:53:30,00","15:56:18,03","00:02:48,03","00:00:03,03","15:53:30,00","15:56:18,03","00:02:48,03","00:02:48.030","00:00:03.030","","","Fahrer"," ","mit der StartNr. ",",hat erfolgreich die Prüfung SP3 absolviert. Zeit:","Fahrer Jürgen Buchhold mit der StartNr. 64 ,hat erfolgreich die Prüfung SP3 absolviert. Zeit:   ","00:00:03.030",1]
[65," Oliver","Klink",65,"———","———","Keine Zeit","———","","","","",{"$f":"ABS(L67-$J$1)","v":{"$error":"#VALUE!"}},"","","Fahrer"," ","mit der StartNr. ",",hat erfolgreich die Prüfung SP3 absolviert. Zeit:","","",{"$f":"IF(U67=\"\",\"\",1)","v":""}]
[66," Peter","Bel",66,"15:46:30,00","15:49:11,37","00:02:41,37","00:00:03,63","15:46:30,00","15:49:11,37","00:02:41,37","00:02:41.370","00:00:03.630","-","-","Fahrer"," ","mit der StartNr. ",",hat erfolgreich die Prüfung SP3 absolviert. Zeit:","Fahrer Peter Bel mit der StartNr. 66 ,hat erfolgreich die Prüfung SP3 absolviert. Zeit: -  -",{"$f":"IF(ISERROR(M68),\"\",M68)","v":"00:00:03.630"},1]
[67," Thomas","Mirau",67,"15:43:00,00","15:45:45,55","00:02:45,55","00:00:03,63",{"$f":"IF(E69=\"———\",\"\",E69)","v":"15:43:00,00"},{"$f":"IF(F69=\"———\",\"\",F69)","v":"15:45:45,55"},{"$f":"IF(G69=\"Keine Zeit\",\"\",G69)","v":"00:02:45,55"},{"$f":"IF(K69=\"\",\"\",J69-I69)","v":"00:02:45.550"},"00:00:00.550","",{"$f":"IF(K96>=J68,\"-\",\"\")","v":""},"Fahrer"," ","mit der StartNr. ",",hat erfolgreich die Prüfung SP3 absolviert. Zeit:",{"$f":"IF(ISERROR(M69),\"\",P69&B69&Q69&C69&Q69&R69&A69&Q69&S69&Q69&N69 &Q69&Q69&O69)","v":"Fahrer Thomas Mirau mit der StartNr. 67 ,hat erfolgreich die Prüfung SP3 absolviert. Zeit:   "},"00:00:00.550",1]
[68," Markus","Gotta",68,"15:24:00,10","15:26:01,08","00:02:00,98","00:00:44,02","15:24:00,10","15:26:01,08","00:02:00,98","00:02:00.980","00:00:44.020",{"$f":"IF(ISERROR(L70),\"\",IF(L70<=$J$1,\"-\",\"\"))","v":"-"},"","Fahrer"," ","mit der StartNr. ",",hat erfolgreich die Prüfung SP3 absolviert. Zeit:","Fahrer Markus Gotta mit der StartNr. 68 ,hat erfolgreich die Prüfung SP3 absolviert. Zeit: -  ","00:00:44.020",1]
[69," Robin","Keulertz",69,"15:50:00,00","15:52:45,58","00:02:45,58","00:00:44,02","15:50:00,00","15:52:45,58","00:02:45,58","00:02:45.580","00:00:00.580","","","Fahrer"," ","mit der StartNr. ",",hat erfolgreich die Prüfung SP3 absolviert. Zeit:","Fahrer Robin Keulertz mit der StartNr. 69 ,hat erfolgreich die Prüfung SP3 absolviert. Zeit:   ","00:00:00.580",1]
[70," Christian","Häp",70,"———","———","Keine Zeit","———","","","","",{"$error":"#VALUE!"},"","","Fahrer"," ","mit der StartNr. ",",hat erfolgreich die Prüfung SP3 absolviert. Zeit:","","",""]
[71," Ingolf","Zschockelt",71,"15:38:00,00","15:40:40,84","00:02:40,84","00:00:04,16","15:38:00,00","15:40:40,84","00:02:40,84","00:02:40.840","00:00:04.160","-","-","Fahrer"," ","mit der StartNr. ",",hat erfolgreich die Prüfung SP3 absolviert. Zeit:","Fahrer Ingolf Zschockelt mit der StartNr. 71 ,hat erfolgreich die Prüfung SP3 absolviert. Zeit: -  -","00:00:04.160",1]
[72," Michael","Barsties",72,"———","———","Keine Zeit","———","","","","",{"$error":"#VALUE!"},"","","Fahrer"," ","mit der StartNr. ",",hat erfolgreich die Prüfung SP3 absolviert. Zeit:","","",""]
[73," Ramona","Wagner",73,"15:44:00,00","15:46:08,61","00:02:08,61","00:00:36,39","15:44:00,00","15:46:08,61","00:02:08,61","00:02:08.610","00:00:36.390","-","-","Fahrer"," ","mit der StartNr. ",",hat erfolgreich die Prüfung SP3 absolviert. Zeit:","Fahrer Ramona Wagner mit der StartNr. 73 ,hat erfolgreich die Prüfung SP3 absolviert. Zeit: -  -","00:00:36.390",1]
[74," Lars","Fahrenbach",74,"16:11:30,00","16:14:14,46","00:02:44,46","00:00:00,54","16:11:30,00","16:14:14,46","00:02:44,46","00:02:44.460","00:00:00.540","-","","Fahrer"," ","mit der StartNr. ",",hat erfolgreich die Prüfung SP3 absolviert. Zeit:","Fahrer Lars Fahrenbach mit der StartNr. 74 ,hat erfolgreich die Prüfung SP3 absolviert. Zeit: -  ","00:00:00.540",1]
[75," Frank","Hoefnagels",75,"15:33:30,00","15:36:14,34","00:02:44,34","00:00:00,66","15:33:30,00","15:36:14,34","00:02:44,34","00:02:44.340","00:00:00.660","-","","Fahrer"," ","mit der StartNr. ",",hat erfolgreich die Prüfung SP3 absolviert. Zeit:","Fahrer Frank Hoefnagels mit der StartNr. 75 ,hat erfolgreich die Prüfung SP3 absolviert. Zeit: -  ","00:00:00.660",1]
[76," Michael","Karch",76,"15:37:00,00","15:39:48,09","00:02:48,09","00:00:03,09","15:37:00,00","15:39:48,09","00:02:48,09","00:02:48.090","00:00:03.090","","","Fahrer"," ","mit der StartNr. ",",hat erfolgreich die Prüfung SP3 absolviert. Zeit:","Fahrer Michael Karch mit der StartNr. 76 ,hat erfolgreich die Prüfung SP3 absolviert. Zeit:   ","00:00:03.090",1]
[77," Dirk","Götze",77,"15:44:30,00","15:47:14,36","00:02:44,36","00:00:00,64","15:44:30,00","15:47:14,36","00:02:44,36","00:02:44.360","00:00:00.640","-","","Fahrer"," ","mit der StartNr. ",",hat erfolgreich die Prüfung SP3 absolviert. Zeit:","Fahrer Dirk Götze mit der StartNr. 77 ,hat erfolgreich die Prüfung SP3 absolviert. Zeit: -  ","00:00:00.640",1]
[78," Stefan","Hillers",78,"15:58:00,00","16:00:45,95","00:02:45,95","00:00:00,64","15:58:00,00","16:00:45,95","00:02:45,95","00:02:45.950","00:00:00.950","","","Fahrer"," ","mit der StartNr. ",",hat erfolgreich die Prüfung SP3 absolviert. Zeit:","Fahrer Stefan Hillers mit der StartNr. 78 ,hat erfolgreich die Prüfung SP3 absolviert. Zeit:   ","00:00:00.950",1]
[79," Christian","Rafflenbeul",79,"15:46:00,00","15:48:45,58","00:02:45,58","00:00:00,64","15:46:00,00","15:48:45,58","00:02:45,58","00:02:45.580","00:00:00.580","","","Fahrer"," ","mit der StartNr. ",",hat erfolgreich die Prüfung SP3 absolviert. Zeit:","Fahrer Christian Rafflenbeul mit der StartNr. 79 ,hat erfolgreich die Prüfung SP3 absolviert. Zeit:   ","00:00:00.580",1]
[80," Gerhard","Reuschel",80,"15:42:00,00","15:44:54,97","00:02:54,97","00:00:09,97","15:42:00,00","15:44:54,97","00:02:54,97","00:02:54.970","00:00:09.970","","","Fahrer"," ","mit der StartNr. ",",hat erfolgreich die Prüfung SP3 absolviert. Zeit:","Fahrer Gerhard Reuschel mit der StartNr. 80 ,hat erfolgreich die Prüfung SP3 absolviert. Zeit:   ","00:00:09.970",1]
[81," Karsten","Rachow",81,"15:53:00,00","15:55:38,48","00:02:38,48","00:00:06,52","15:53:00,00","15:55:38,48","00:02:38,48","00:02:38.480","00:00:06.520","-","","Fahrer"," ","mit der StartNr. ",",hat erfolgreich die Prüfung SP3 absolviert. Zeit:","Fahrer Karsten Rachow mit der StartNr. 81 ,hat erfolgreich die Prüfung SP3 absolviert. Zeit: -  ","00:00:06.520",1]
[82," Jürgen","Ziller",82,"———","———","Keine Zeit","———","","","","",{"$error":"#VALUE!"},"","","Fahrer"," ","mit der StartNr. ",",hat erfolgreich die Prüfung SP3 absolviert. Zeit:","","",""]
[83," Alexander","Weil",83,"15:52:30,00","15:55:16,16","00:02:46,16","00:00:01,16","15:52:30,00","15:55:16,16","00:02:46,16","00:02:46.160","00:00:01.160","","-","Fahrer"," ","mit der StartNr. ",",hat erfolgreich die Prüfung SP3 absolviert. Zeit:","Fahrer Alexander Weil mit der StartNr. 83 ,hat erfolgreich die Prüfung SP3 absolviert. Zeit:   -","00:00:01.160",1]
[84," Josef","Lindenberger",84,"16:07:30,00","16:10:30,54","00:03:00,54","00:00:15,54","16:07:30,00","16:10:30,54","00:03:00,54","00:03:00.540","00:00:15.540","","","Fahrer"," ","mit der StartNr. ",",hat erfolgreich die Prüfung SP3 absolviert. Zeit:","Fahrer Josef Lindenberger mit der StartNr. 84 ,hat erfolgreich die Prüfung SP3 absolviert. Zeit:   ","00:00:15.540",1]
[85," Rick","Durante",85,"15:48:30,00","15:51:01,14","00:02:31,14","00:00:13,86","15:48:30,00","15:51:01,14","00:02:31,14","00:02:31.140","00:00:13.860","-","","Fahrer"," ","mit der StartNr. ",",hat erfolgreich die Prüfung SP3 absolviert. Zeit:","Fahrer Rick Durante mit der StartNr. 85 ,hat erfolgreich die Prüfung SP3 absolviert. Zeit: -  ","00:00:13.860",1]
[86," Almuth","Siemann",86,"15:48:00,00","15:50:44,69","00:02:44,69","00:00:00,31","15:48:00,00","15:50:44,69","00:02:44,69","00:02:44.690","00:00:00.310","-","","Fahrer"," ","mit der StartNr. ",",hat erfolgreich die Prüfung SP3 absolviert. Zeit:","Fahrer Almuth Siemann mit der StartNr. 86 ,hat erfolgreich die Prüfung SP3 absolviert. Zeit: -  ","00:00:00.310",1]
[87," Axel","Strigl",87,"16:08:30,00","16:11:00,88","00:02:30,88","00:00:14,12","16:08:30,00","16:11:00,88","00:02:30,88","00:02:30.880","00:00:14.120","-","","Fahrer"," ","mit der StartNr. ",",hat erfolgreich die Prüfung SP3 absolviert. Zeit:","Fahrer Axel Strigl mit der StartNr. 87 ,hat erfolgreich die Prüfung SP3 absolviert. Zeit: -  ","00:00:14.120",1]
[88," Philip","Sommer",88,"15:20:30,00","15:23:15,58","00:02:45,58","00:00:14,12","15:20:30,00","15:23:15,58","00:02:45,58","00:02:45.580","00:00:00.580","","","Fahrer"," ","mit der StartNr. ",",hat erfolgreich die Prüfung SP3 absolviert. Zeit:","Fahrer Philip Sommer mit der StartNr. 88 ,hat erfolgreich die Prüfung SP3 absolviert. Zeit:   ","00:00:00.580",1]
[89," Jörg","Diehl",89,"16:09:30,00","16:12:15,67","00:02:45,67","00:00:14,12","16:09:30,00","16:12:15,67","00:02:45,67","00:02:45.670","00:00:00.670","","","Fahrer"," ","mit der StartNr. ",",hat erfolgreich die Prüfung SP3 absolviert. Zeit:","Fahrer Jörg Diehl mit der StartNr. 89 ,hat erfolgreich die Prüfung SP3 absolviert. Zeit:   ","00:00:00.670",1]
[90," Matthias","Herzig",90,"16:04:30,00","16:07:14,49","00:02:44,49","00:00:00,51","16:04:30,00","16:07:14,49","00:02:44,49","00:02:44.490","00:00:00.510","-","","Fahrer"," ","mit der StartNr. ",",hat erfolgreich die Prüfung SP3 absolviert. Zeit:","Fahrer Matthias Herzig mit der StartNr. 90 ,hat erfolgreich die Prüfung SP3 absolviert. Zeit: -  ","00:00:00.510",1]
[91," Christoph","Pasternak",91,"15:45:00,00","15:47:47,05","00:02:47,05","00:00:02,05","15:45:00,00","15:47:47,05","00:02:47,05","00:02:47.050","00:00:02.050","","","Fahrer"," ","mit der StartNr. ",",hat erfolgreich die Prüfung SP3 absolviert. Zeit:","Fahrer Christoph Pasternak mit der StartNr. 91 ,hat erfolgreich die Prüfung SP3 absolviert. Zeit:   ","00:00:02.050",1]
[92," Lothar","Schupet",92,"16:00:00,00","16:02:45,98","00:02:45,98","00:00:02,05","16:00:00,00","16:02:45,98","00:02:45,98","00:02:45.980","00:00:00.980","","","Fahrer"," ","mit der StartNr. ",",hat erfolgreich die Prüfung SP3 absolviert. Zeit:","Fahrer Lothar Schupet mit der StartNr. 92 ,hat erfolgreich die Prüfung SP3 absolviert. Zeit:   ","00:00:00.980",1]
[93," Wolfgang","Schertler",93,"15:56:00,00","15:58:54,78","00:02:54,78","00:00:09,78","15:56:00,00","15:58:54,78","00:02:54,78","00:02:54.780","00:00:09.780","","","Fahrer"," ","mit der StartNr. ",",hat erfolgreich die Prüfung SP3 absolviert. Zeit:","Fahrer Wolfgang Schertler mit der StartNr. 93 ,hat erfolgreich die Prüfung SP3 absolviert. Zeit:   ","00:00:09.780",1]
[94," Thomas","Katzensteiner",94,"16:10:30,00","16:13:15,50","00:02:45,50","00:00:09,78","16:10:30,00","16:13:15,50","00:02:45,50","00:02:45.500","00:00:00.500","","","Fahrer"," ","mit der StartNr. ",",hat erfolgreich die Prüfung SP3 absolviert. Zeit:","Fahrer Thomas Katzensteiner mit der StartNr. 94 ,hat erfolgreich die Prüfung SP3 absolviert. Zeit:   ","00:00:00.500",1]
[95," Hagen","Hackenberg",95,"———","———","Keine Zeit","———","","","","",{"$error":"#VALUE!"},"","","Fahrer"," ","mit der StartNr. ",",hat erfolgreich die Prüfung SP3 absolviert. Zeit:","","",""]
[96," Oliver","Dietz",96,"16:06:00,00","16:08:45,16","00:02:45,16","00:00:09,78","16:06:00,00","16:08:45,16","00:02:45,16","00:02:45.160","00:00:00.160","","-","Fahrer"," ","mit der StartNr. ",",hat erfolgreich die Prüfung SP3 absolviert. Zeit:","Fahrer Oliver Dietz mit der StartNr. 96 ,hat erfolgreich die Prüfung SP3 absolviert. Zeit:   -","00:00:00.160",1]
[97," Horst","Kempf",97,"15:59:00,00","16:01:44,35","00:02:44,35","00:00:00,65","15:59:00,00","16:01:44,35","00:02:44,35","00:02:44.350",{"$f":"ABS(L99-$J$1)","v":"00:00:00.650"},"-","","Fahrer"," ","mit der StartNr. ",",hat erfolgreich die Prüfung SP3 absolviert. Zeit:","Fahrer Horst Kempf mit der StartNr. 97 ,hat erfolgreich die Prüfung SP3 absolviert. Zeit: -  ","00:00:00.650",1]
[98," Detlev","Pauer",98,"16:18:00,00","16:20:41,74","00:02:41,74","00:00:03,26","16:18:00,00","16:20:41,74","00:02:41,74","00:02:41.740","00:00:03.260","-","","Fahrer"," ","mit der StartNr. ",",hat erfolgreich die Prüfung SP3 absolviert. Zeit:","Fahrer Detlev Pauer mit der StartNr. 98 ,hat erfolgreich die Prüfung SP3 absolviert. Zeit: -  ","00:00:03.260",1]
[99," Dirk","Velte",99,"16:06:30,00","16:09:15,85","00:02:45,85","00:00:03,26","16:06:30,00","16:09:15,85","00:02:45,85","00:02:45.850","00:00:00.850","","","Fahrer"," ","mit der StartNr. ",",hat erfolgreich die Prüfung SP3 absolviert. Zeit:","Fahrer Dirk Velte mit der StartNr. 99 ,hat erfolgreich die Prüfung SP3 absolviert. Zeit:   ","00:00:00.850",1]
[100," Thorsten","Krack",100,"15:47:30,00","15:50:14,92","00:02:44,92","00:00:00,08","15:47:30,00","15:50:14,92","00:02:44,92","00:02:44.920","00:00:00.080","-","","Fahrer"," ","mit der StartNr. ",",hat erfolgreich die Prüfung SP3 absolviert. Zeit:","Fahrer Thorsten Krack mit der StartNr. 100 ,hat erfolgreich die Prüfung SP3 absolviert. Zeit: -  ","00:00:00.080",1]
[101," Christian","Wittek",101,"16:03:30,00","16:05:59,49","00:02:29,49","00:00:15,51","16:03:30,00","16:05:59,49","00:02:29,49","00:02:29.490","00:00:15.510","-","","Fahrer"," ","mit der StartNr. ",",hat erfolgreich die Prüfung SP3 absolviert. Zeit:","Fahrer Christian Wittek mit der StartNr. 101 ,hat erfolgreich die Prüfung SP3 absolviert. Zeit: -  ","00:00:15.510",1]
[102," Benjamin","Hix",102,"15:49:00,00","15:51:57,70","00:02:57,70","00:00:12,70","15:49:00,00","15:51:57,70","00:02:57,70","00:02:57.700","00:00:12.700","","","Fahrer"," ","mit der StartNr. ",",hat erfolgreich die Prüfung SP3 absolviert. Zeit:","Fahrer Benjamin Hix mit der StartNr. 102 ,hat erfolgreich die Prüfung SP3 absolviert. Zeit:   ","00:00:12.700",1]
[null,null,null,null,null,null,null,null,null,null,null,null,null,null,null,null,null,null,null,null,null,{"$f":"SUM(V3:V104)","v":93}]

{"sheet":"SP4","index":3,"n_rows":105,"n_cols":22,"rows_kept":105,"cut":false,"hidden":false,"merged":[]}
[null,null,null,null,null,null,null,null,null,"00:02:10"]
[null,null,null,"#","Start","Ziel","Fahrtzeit","Abweichung","Start","Ziel","Fahrzeit","Zeit","Diff.",null,null,null,null,null,"bitte auf das Vorzeichen \"-\" achten!","m:ss,00"]
[1," Christian","Jäger",1,"15:20:00,00","15:22:10,13","00:02:10,13","00:00:00,00",{"$f":"IF(E3=\"———\",\"\",E3)","v":"15:20:00,00"},{"$f":"IF(F3=\"———\",\"\",F3)","v":"15:22:10,13"},{"$f":"IF(I3=\"\",\"\",J3-I3)","v":"00:02:10.130"},{"$f":"IF(K3=\"\",\"\",J3-I3)","v":"00:02:10.130"},{"$f":"ABS(L3-$J$1)","v":"00:00:00.130"},{"$f":"IF(ISERROR(L3),\"\",IF(L3<=$J$1,\"-\",\"\"))","v":""},"Fahrer"," ","mit der StartNr. ",",hat erfolgreich die Prüfung SP4 absolviert. Zeit:",{"$f":"IF(ISERROR(M3),\"\",O3&B3&P3&C3&P3&Q3&A3&P3&R3&P3&N3)","v":"Fahrer Christian Jäger mit der StartNr. 1 ,hat erfolgreich die Prüfung SP4 absolviert. Zeit: "},{"$f":"IF(ISERROR(M3),\"\",M3)","v":"00:00:00.130"},{"$f":"IF(T3=\"\",\"\",1)","v":1}]
[2," Daniel","Rinck",2,"15:21:00,00","15:23:10,63","00:02:10,63","00:00:00,00","15:21:00,00",{"$f":"IF(F4=\"———\",\"\",F4)","v":"15:23:10,63"},"00:02:10.630",{"$f":"IF(K4=\"\",\"\",J4-I4)","v":"00:02:10.630"},"00:00:00.630",{"$f":"IF(ISERROR(L4),\"\",IF(L4<=$J$1,\"-\",\"\"))","v":""},"Fahrer"," ","mit der StartNr. ",",hat erfolgreich die Prüfung SP4 absolviert. Zeit:","Fahrer Daniel Rinck mit der StartNr. 2 ,hat erfolgreich die Prüfung SP4 absolviert. Zeit: ",{"$f":"IF(ISERROR(M4),\"\",M4)","v":"00:00:00.630"},1]
[3," Malte","Proff-Klein",3,"———","15:29:41,29","Keine Zeit","———","","15:29:41,29","","",{"$error":"#VALUE!"},"","Fahrer"," ","mit der StartNr. ",",hat erfolgreich die Prüfung SP4 absolviert. Zeit:","","",""]
[4," Dietmar","Siemssen",4,"———","15:30:10,52","Keine Zeit","———","","15:30:10,52",{"$f":"IF(I6=\"\",\"\",J6-I6)","v":""},"",{"$error":"#VALUE!"},"","Fahrer"," ","mit der StartNr. ",",hat erfolgreich die Prüfung SP4 absolviert. Zeit:","","",""]
[5," Franz-Michael","Hartmann",5,"15:21:30,00","15:23:40,59","00:02:10,59","00:00:00,00","15:21:30,00","15:23:40,59","00:02:10.590","00:02:10.590","00:00:00.590","","Fahrer"," ","mit der StartNr. ",",hat erfolgreich die Prüfung SP4 absolviert. Zeit:","Fahrer Franz-Michael Hartmann mit der StartNr. 5 ,hat erfolgreich die Prüfung SP4 absolviert. Zeit: ","00:00:00.590",1]
[6," Christoph","Schroer",6,"15:24:30,00","15:26:39,23","00:02:09,23","00:00:00,77","15:24:30,00","15:26:39,23","00:02:09.230","00:02:09.230","00:00:00.770","-","Fahrer"," ","mit der StartNr. ",",hat erfolgreich die Prüfung SP4 absolviert. Zeit:","Fahrer Christoph Schroer mit der StartNr. 6 ,hat erfolgreich die Prüfung SP4 absolviert. Zeit: -","00:00:00.770",1]
[7," Jochen","Artzinger-Bolten",7,"15:22:30,00","15:24:38,66","00:02:08,66","00:00:01,34","15:22:30,00","15:24:38,66","00:02:08.660","00:02:08.660","00:00:01.340","-","Fahrer"," ","mit der StartNr. ",",hat erfolgreich die Prüfung SP4 absolviert. Zeit:","Fahrer Jochen Artzinger-Bolten mit der StartNr. 7 ,hat erfolgreich die Prüfung SP4 absolviert. Zeit: -","00:00:01.340",1]
[8," Friedhelm","Eickhorn",8,"15:22:00,00","15:24:11,34","00:02:11,34","00:00:01,34","15:22:00,00","15:24:11,34","00:02:11.340","00:02:11.340","00:00:01.340","","Fahrer"," ","mit der StartNr. ",",hat erfolgreich die Prüfung SP4 absolviert. Zeit:","Fahrer Friedhelm Eickhorn mit der StartNr. 8 ,hat erfolgreich die Prüfung SP4 absolviert. Zeit: ","00:00:01.340",1]
[9," Carsten","Reblin",9,"15:23:30,00","15:25:41,05","00:02:11,05","00:00:01,05","15:23:30,00","15:25:41,05","00:02:11.050","00:02:11.050","00:00:01.050","","Fahrer"," ","mit der StartNr. ",",hat erfolgreich die Prüfung SP4 absolviert. Zeit:","Fahrer Carsten Reblin mit der StartNr. 9 ,hat erfolgreich die Prüfung SP4 absolviert. Zeit: ","00:00:01.050",1]
[10," Dieter","Dinges",10,"15:24:00,00","15:26:12,39","00:02:12,39","00:00:02,39","15:24:00,00","15:26:12,39","00:02:12.390","00:02:12.390","00:00:02.390","","Fahrer"," ","mit der StartNr. ",",hat erfolgreich die Prüfung SP4 absolviert. Zeit:","Fahrer Dieter Dinges mit der StartNr. 10 ,hat erfolgreich die Prüfung SP4 absolviert. Zeit: ","00:00:02.390",1]
[11," Wolfgang","Reeh",11,"15:25:00,00","15:27:10,33","00:02:10,33","00:00:02,39","15:25:00,00","15:27:10,33","00:02:10.330","00:02:10.330","00:00:00.330","","Fahrer"," ","mit der StartNr. ",",hat erfolgreich die Prüfung SP4 absolviert. Zeit:","Fahrer Wolfgang Reeh mit der StartNr. 11 ,hat erfolgreich die Prüfung SP4 absolviert. Zeit: ","00:00:00.330",1]
[12," Andreas","Petry",12,"15:25:30,00","15:27:41,72","00:02:11,72","00:00:01,72","15:25:30,00","15:27:41,72","00:02:11.720","00:02:11.720","00:00:01.720","","Fahrer"," ","mit der StartNr. ",",hat erfolgreich die Prüfung SP4 absolviert. Zeit:","Fahrer Andreas Petry mit der StartNr. 12 ,hat erfolgreich die Prüfung SP4 absolviert. Zeit: ","00:00:01.720",1,"y"]
[13," Ted","Prenzel",13,"15:26:00,00","15:28:10,17","00:02:10,17","00:00:01,72","15:26:00,00","15:28:10,17","00:02:10.170","00:02:10.170","00:00:00.170","","Fahrer"," ","mit der StartNr. ",",hat erfolgreich die Prüfung SP4 absolviert. Zeit:","Fahrer Ted Prenzel mit der StartNr. 13 ,hat erfolgreich die Prüfung SP4 absolviert. Zeit: ","00:00:00.170",1]
[14," Micha","Barsties",14,"———","15:30:46,37","Keine Zeit","———","","15:30:46,37","","",{"$error":"#VALUE!"},"","Fahrer"," ","mit der StartNr. ",",hat erfolgreich die Prüfung SP4 absolviert. Zeit:","","",""]
[15," Klaus","Flettner",15,"———","———","Keine Zeit","———","","","","",{"$error":"#VALUE!"},"","Fahrer"," ","mit der StartNr. ",",hat erfolgreich die Prüfung SP4 absolviert. Zeit:","","",""]
[16," Heinz","Frey",16,"———","15:28:40,66","Keine Zeit","———","","15:28:40,66","","",{"$error":"#VALUE!"},"","Fahrer"," ","mit der StartNr. ",",hat erfolgreich die Prüfung SP4 absolviert. Zeit:","","",""]
[17," Henning","Reichel",17,"———","15:29:10,66","Keine Zeit","———","","15:29:10,66","","",{"$error":"#VALUE!"},"","Fahrer"," ","mit der StartNr. ",",hat erfolgreich die Prüfung SP4 absolviert. Zeit:","","",""]
[18," Maik","Käbisch",18,"———","16:47:10,29","Keine Zeit","———","","16:47:10,29","","",{"$error":"#VALUE!"},"","Fahrer"," ","mit der StartNr. ",",hat erfolgreich die Prüfung SP4 absolviert. Zeit:","","",""]
[19," Harald","Zapp",19,"———","15:31:10,55","Keine Zeit","———","","15:31:10,55","","",{"$error":"#VALUE!"},"","Fahrer"," ","mit der StartNr. ",",hat erfolgreich die Prüfung SP4 absolviert. Zeit:","","",""]
[20," Reinhard","Grzesik",20,"———","15:32:10,85","Keine Zeit","———","","15:32:10,85","","",{"$error":"#VALUE!"},"","Fahrer"," ","mit der StartNr. ",",hat erfolgreich die Prüfung SP4 absolviert. Zeit:","","",""]
[21," Jörg","Sihler",21,"———","15:33:11,15","Keine Zeit","———","","15:33:11,15","","",{"$error":"#VALUE!"},"","Fahrer"," ","mit der StartNr. ",",hat erfolgreich die Prüfung SP4 absolviert. Zeit:","","",""]
[22," Ingo","Winterstein",22,"15:34:30,00","15:37:19,79","00:02:49,79","00:00:39,79","15:34:30,00","15:37:19,79","00:02:49.790","00:02:49.790","00:00:39.790","","Fahrer"," ","mit der StartNr. ",",hat erfolgreich die Prüfung SP4 absolviert. Zeit:","Fahrer Ingo Winterstein mit der StartNr. 22 ,hat erfolgreich die Prüfung SP4 absolviert. Zeit: ","00:00:39.790",1]
[23," Hans Werner","Melchior",23,"———","15:31:37,77","Keine Zeit","———","","15:31:37,77","","",{"$error":"#VALUE!"},"","Fahrer"," ","mit der StartNr. ",",hat erfolgreich die Prüfung SP4 absolviert. Zeit:","","",""]
[24," Marco","Oriolo",24,"16:19:00,00","———","Keine Zeit","———","16:19:00,00","",{"$error":"#VALUE!"},{"$error":"#VALUE!"},{"$error":"#VALUE!"},"","Fahrer"," ","mit der StartNr. ",",hat erfolgreich die Prüfung SP4 absolviert. Zeit:","","",""]
[25," Manfred","Stommel",25,"———","15:32:43,77","Keine Zeit","———","","15:32:43,77","","",{"$error":"#VALUE!"},"","Fahrer"," ","mit der StartNr. ",",hat erfolgreich die Prüfung SP4 absolviert. Zeit:","","",""]
[26," Carolin","Heusel",26,"15:39:00,00","15:41:10,17","00:02:10,17","00:00:39,79","15:39:00,00","15:41:10,17","00:02:10.170","00:02:10.170","00:00:00.170","","Fahrer"," ","mit der StartNr. ",",hat erfolgreich die Prüfung SP4 absolviert. Zeit:","Fahrer Carolin Heusel mit der StartNr. 26 ,hat erfolgreich die Prüfung SP4 absolviert. Zeit: ","00:00:00.170",1]
[27," Regina","Philippi",27,"15:36:00,00","15:38:10,78","00:02:10,78","00:00:39,79","15:36:00,00","15:38:10,78","00:02:10.780","00:02:10.780","00:00:00.780","","Fahrer"," ","mit der StartNr. ",",hat erfolgreich die Prüfung SP4 absolviert. Zeit:","Fahrer Regina Philippi mit der StartNr. 27 ,hat erfolgreich die Prüfung SP4 absolviert. Zeit: ","00:00:00.780",1]
[28," Christof","Aha",28,"———","15:33:40,01","Keine Zeit","———","","15:33:40,01","","",{"$error":"#VALUE!"},"","Fahrer"," ","mit der StartNr. ",",hat erfolgreich die Prüfung SP4 absolviert. Zeit:","","",""]
[29," Dennis","Weiss",29,"15:59:00,00","16:01:11,02","00:02:11,02","00:00:01,02","15:59:00,00","16:01:11,02","00:02:11.020","00:02:11.020","00:00:01.020","","Fahrer"," ","mit der StartNr. ",",hat erfolgreich die Prüfung SP4 absolviert. Zeit:","Fahrer Dennis Weiss mit der StartNr. 29 ,hat erfolgreich die Prüfung SP4 absolviert. Zeit: ","00:00:01.020",1]
[30," Harald","Hamprecht",30,"15:53:00,00","15:55:10,31","00:02:10,31","00:00:01,02","15:53:00,00","15:55:10,31","00:02:10.310","00:02:10.310","00:00:00.310","","Fahrer"," ","mit der StartNr. ",",hat erfolgreich die Prüfung SP4 absolviert. Zeit:","Fahrer Harald Hamprecht mit der StartNr. 30 ,hat erfolgreich die Prüfung SP4 absolviert. Zeit: ","00:00:00.310",1]
[31," Reno","Fiolic",31,"———","15:34:02,84","Keine Zeit","———","","15:34:02,84","","",{"$error":"#VALUE!"},"","Fahrer"," ","mit der StartNr. ",",hat erfolgreich die Prüfung SP4 absolviert. Zeit:","","",""]
[32," Jürgen","Kulpe",32,"———","15:37:13,35","Keine Zeit","———","","15:37:13,35","","",{"$error":"#VALUE!"},"","Fahrer"," ","mit der StartNr. ",",hat erfolgreich die Prüfung SP4 absolviert. Zeit:","","",""]
[33," Konstantin","Kovarbasic",33,"15:33:30,00","15:35:44,81","00:02:14,81","00:00:04,81","15:33:30,00","15:35:44,81","00:02:14.810","00:02:14.810","00:00:04.810","","Fahrer"," ","mit der StartNr. ",",hat erfolgreich die Prüfung SP4 absolviert. Zeit:","Fahrer Konstantin Kovarbasic mit der StartNr. 33 ,hat erfolgreich die Prüfung SP4 absolviert. Zeit: ","00:00:04.810",1]
[34," Nikolaus","Kratz",34,"15:40:00,00","15:42:11,68","00:02:11,68","00:00:01,68","15:40:00,00","15:42:11,68","00:02:11.680","00:02:11.680","00:00:01.680","","Fahrer"," ","mit der StartNr. ",",hat erfolgreich die Prüfung SP4 absolviert. Zeit:","Fahrer Nikolaus Kratz mit der StartNr. 34 ,hat erfolgreich die Prüfung SP4 absolviert. Zeit: ","00:00:01.680",1]
[35," Andreas","Eberhardt",35,"15:41:00,00","15:43:10,71","00:02:10,71","00:00:01,68","15:41:00,00","15:43:10,71","00:02:10.710","00:02:10.710","00:00:00.710","","Fahrer"," ","mit der StartNr. ",",hat erfolgreich die Prüfung SP4 absolviert. Zeit:","Fahrer Andreas Eberhardt mit der StartNr. 35 ,hat erfolgreich die Prüfung SP4 absolviert. Zeit: ","00:00:00.710",1]
[36," Gerhard","Thomas",36,"15:34:00,00","15:36:15,04","00:02:15,04","00:00:05,04","15:34:00,00","15:36:15,04","00:02:15.040","00:02:15.040","00:00:05.040","","Fahrer"," ","mit der StartNr. ",",hat erfolgreich die Prüfung SP4 absolviert. Zeit:","Fahrer Gerhard Thomas mit der StartNr. 36 ,hat erfolgreich die Prüfung SP4 absolviert. Zeit: ","00:00:05.040",1]
[37," Lotzi","Kende",37,"———","15:35:10,24","Keine Zeit","———","","15:35:10,24","","",{"$error":"#VALUE!"},"","Fahrer"," ","mit der StartNr. ",",hat erfolgreich die Prüfung SP4 absolviert. Zeit:","","",""]
[38," Jockel","Winkelhock",38,"———","———","Keine Zeit","———","","","","",{"$error":"#VALUE!"},"","Fahrer"," ","mit der StartNr. ",",hat erfolgreich die Prüfung SP4 absolviert. Zeit:","","",""]
[39," Sascha","Wilkesmann",39,"15:35:30,00","15:37:39,68","00:02:09,68","00:00:00,32","15:35:30,00","15:37:39,68","00:02:09.680","00:02:09.680","00:00:00.320","-","Fahrer"," ","mit der StartNr. ",",hat erfolgreich die Prüfung SP4 absolviert. Zeit:","Fahrer Sascha Wilkesmann mit der StartNr. 39 ,hat erfolgreich die Prüfung SP4 absolviert. Zeit: -","00:00:00.320",1]
[40," Gregor","Schulz",40,"15:58:00,00","16:00:33,72","00:02:33,72","00:00:23,72","15:58:00,00","16:00:33,72","00:02:33.720","00:02:33.720","00:00:23.720","","Fahrer"," ","mit der StartNr. ",",hat erfolgreich die Prüfung SP4 absolviert. Zeit:","Fahrer Gregor Schulz mit der StartNr. 40 ,hat erfolgreich die Prüfung SP4 absolviert. Zeit: ","00:00:23.720",1]
[41," Peer","Hildmann",41,"———","15:34:39,05","Keine Zeit","———","","15:34:39,05","","",{"$error":"#VALUE!"},"","Fahrer"," ","mit der StartNr. ",",hat erfolgreich die Prüfung SP4 absolviert. Zeit:","","",""]
[42," Mina","Tander",42,"———","———","Keine Zeit","———","","","","",{"$error":"#VALUE!"},"","Fahrer"," ","mit der StartNr. ",",hat erfolgreich die Prüfung SP4 absolviert. Zeit:","","",""]
[43," Stefan","Iskan",43,"———","———","Keine Zeit","———","","","","",{"$error":"#VALUE!"},"","Fahrer"," ","mit der StartNr. ",",hat erfolgreich die Prüfung SP4 absolviert. Zeit:","","",""]
[44," Jean-Philippe","Kempf",44,"15:51:00,00","15:52:56,80","00:01:56,80","00:00:13,20","15:51:00,00","15:52:56,80","00:01:56.800","00:01:56.800","00:00:13.200","-","Fahrer"," ","mit der StartNr. ",",hat erfolgreich die Prüfung SP4 absolviert. Zeit:","Fahrer Jean-Philippe Kempf mit der StartNr. 44 ,hat erfolgreich die Prüfung SP4 absolviert. Zeit: -","00:00:13.200",1]
[45," Daniel","Martin",45,"15:43:00,00","15:45:21,85","00:02:21,85","00:00:11,85","15:43:00,00","15:45:21,85","00:02:21.850","00:02:21.850","00:00:11.850","","Fahrer"," ","mit der StartNr. ",",hat erfolgreich die Prüfung SP4 absolviert. Zeit:","Fahrer Daniel Martin mit der StartNr. 45 ,hat erfolgreich die Prüfung SP4 absolviert. Zeit: ","00:00:11.850",1]
[46," Elena","Funk",46,"16:34:00,00","16:36:09,33","00:02:09,33","00:00:00,67","16:34:00,00","16:36:09,33","00:02:09.330","00:02:09.330","00:00:00.670","-","Fahrer"," ","mit der StartNr. ",",hat erfolgreich die Prüfung SP4 absolviert. Zeit:","Fahrer Elena Funk mit der StartNr. 46 ,hat erfolgreich die Prüfung SP4 absolviert. Zeit: -","00:00:00.670",1]
[47," Hans","Mutschall",47,"15:42:00,00","15:44:10,40","00:02:10,40","00:00:00,67","15:42:00,00","15:44:10,40","00:02:10.400","00:02:10.400","00:00:00.400","","Fahrer"," ","mit der StartNr. ",",hat erfolgreich die Prüfung SP4 absolviert. Zeit:","Fahrer Hans Mutschall mit der StartNr. 47 ,hat erfolgreich die Prüfung SP4 absolviert. Zeit: ","00:00:00.400",1]
[48," Kahled","Rahman",48,"15:38:00,00","15:40:11,21","00:02:11,21","00:00:01,21","15:38:00,00","15:40:11,21","00:02:11.210","00:02:11.210","00:00:01.210","","Fahrer"," ","mit der StartNr. ",",hat erfolgreich die Prüfung SP4 absolviert. Zeit:","Fahrer Kahled Rahman mit der StartNr. 48 ,hat erfolgreich die Prüfung SP4 absolviert. Zeit: ","00:00:01.210",1]
[49," Jochen","Schwarz",49,"15:47:00,00","15:49:10,37","00:02:10,37","00:00:01,21","15:47:00,00","15:49:10,37","00:02:10.370","00:02:10.370","00:00:00.370","","Fahrer"," ","mit der StartNr. ",",hat erfolgreich die Prüfung SP4 absolviert. Zeit:","Fahrer Jochen Schwarz mit der StartNr. 49 ,hat erfolgreich die Prüfung SP4 absolviert. Zeit: ","00:00:00.370",1]
[50," Axel","Nawrath",50,"———","———","Keine Zeit","———","","","","",{"$error":"#VALUE!"},"","Fahrer"," ","mit der StartNr. ",",hat erfolgreich die Prüfung SP4 absolviert. Zeit:","","",""]
[51," Birgit","Claussen",51,"15:50:00,00","———","Keine Zeit","———","15:50:00,00","",{"$error":"#VALUE!"},{"$error":"#VALUE!"},{"$error":"#VALUE!"},"","Fahrer"," ","mit der StartNr. ",",hat erfolgreich die Prüfung SP4 absolviert. Zeit:","","",""]
[52," Harald","König",52,"15:54:00,00","15:56:07,52","00:02:07,52","00:00:02,48","15:54:00,00","15:56:07,52","00:02:07.520","00:02:07.520","00:00:02.480","-","Fahrer"," ","mit der StartNr. ",",hat erfolgreich die Prüfung SP4 absolviert. Zeit:","Fahrer Harald König mit der StartNr. 52 ,hat erfolgreich die Prüfung SP4 absolviert. Zeit: -","00:00:02.480",1]
[53," Thomas","Blank",53,"15:49:00,00","15:51:09,98","00:02:09,98","00:00:00,02","15:49:00,00","15:51:09,98","00:02:09.980","00:02:09.980","00:00:00.020","-","Fahrer"," ","mit der StartNr. ",",hat erfolgreich die Prüfung SP4 absolviert. Zeit:","Fahrer Thomas Blank mit der StartNr. 53 ,hat erfolgreich die Prüfung SP4 absolviert. Zeit: -","00:00:00.020",1]
[54," Heidi","Eberhardt",54,"16:09:00,00","16:11:16,43","00:02:16,43","00:00:06,43","16:09:00,00","16:11:16,43","00:02:16.430","00:02:16.430","00:00:06.430","","Fahrer"," ","mit der StartNr. ",",hat erfolgreich die Prüfung SP4 absolviert. Zeit:","Fahrer Heidi Eberhardt mit der StartNr. 54 ,hat erfolgreich die Prüfung SP4 absolviert. Zeit: ","00:00:06.430",1]
[55," Karina","Ansos",55,"16:08:00,00","16:10:09,83","00:02:09,83","00:00:00,17","16:08:00,00","16:10:09,83","00:02:09.830","00:02:09.830","00:00:00.170","-","Fahrer"," ","mit der StartNr. ",",hat erfolgreich die Prüfung SP4 absolviert. Zeit:","Fahrer Karina Ansos mit der StartNr. 55 ,hat erfolgreich die Prüfung SP4 absolviert. Zeit: -","00:00:00.170",1]
[56," Michael","Gotta",56,"15:44:00,00","15:46:11,23","00:02:11,23","00:00:01,23","15:44:00,00","15:46:11,23","00:02:11.230","00:02:11.230","00:00:01.230","","Fahrer"," ","mit der StartNr. ",",hat erfolgreich die Prüfung SP4 absolviert. Zeit:","Fahrer Michael Gotta mit der StartNr. 56 ,hat erfolgreich die Prüfung SP4 absolviert. Zeit: ","00:00:01.230",1]
[57," Stefanie","Rinck",57,"16:13:00,00","16:15:10.460","00:02:10,46","00:59:59,54","16:13:00,00","16:15:10.460","00:02:10.460","00:02:10.460","00:00:00.460","","Fahrer"," ","mit der StartNr. ",",hat erfolgreich die Prüfung SP4 absolviert. Zeit:","Fahrer Stefanie Rinck mit der StartNr. 57 ,hat erfolgreich die Prüfung SP4 absolviert. Zeit: ","00:00:00.460",1]
[58," Armin","Slotta",58,"15:57:00,00","15:59:52,11","00:02:52,11","00:00:42,11","15:57:00,00","15:59:52,11","00:02:52.110","00:02:52.110","00:00:42.110","","Fahrer"," ","mit der StartNr. ",",hat erfolgreich die Prüfung SP4 absolviert. Zeit:","Fahrer Armin Slotta mit der StartNr. 58 ,hat erfolgreich die Prüfung SP4 absolviert. Zeit: ","00:00:42.110",1]
[59," Julia","Kende",59,"16:24:00,00","16:26:09,64","00:02:09,64","00:00:00,36","16:24:00,00","16:26:09,64","00:02:09.640","00:02:09.640","00:00:00.360","-","Fahrer"," ","mit der StartNr. ",",hat erfolgreich die Prüfung SP4 absolviert. Zeit:","Fahrer Julia Kende mit der StartNr. 59 ,hat erfolgreich die Prüfung SP4 absolviert. Zeit: -","00:00:00.360",1]
[60," Robert","Bleckmann",60,"15:55:00,00","15:57:08,69","00:02:08,69","00:00:01,31","15:55:00,00","15:57:08,69","00:02:08.690","00:02:08.690","00:00:01.310","-","Fahrer"," ","mit der StartNr. ",",hat erfolgreich die Prüfung SP4 absolviert. Zeit:","Fahrer Robert Bleckmann mit der StartNr. 60 ,hat erfolgreich die Prüfung SP4 absolviert. Zeit: -","00:00:01.310",1]
[61," Christof","Harwardt",61,"15:52:00,00","15:54:09,13","00:02:09,13","00:00:00,87","15:52:00,00","15:54:09,13","00:02:09.130","00:02:09.130","00:00:00.870","-","Fahrer"," ","mit der StartNr. ",",hat erfolgreich die Prüfung SP4 absolviert. Zeit:","Fahrer Christof Harwardt mit der StartNr. 61 ,hat erfolgreich die Prüfung SP4 absolviert. Zeit: -","00:00:00.870",1]
[62," Thomas","Kahns",62,"16:23:00,00","16:25:00,82","00:02:00,82","00:00:09,18","16:23:00,00","16:25:00,82","00:02:00.820","00:02:00.820","00:00:09.180","-","Fahrer"," ","mit der StartNr. ",",hat erfolgreich die Prüfung SP4 absolviert. Zeit:","Fahrer Thomas Kahns mit der StartNr. 62 ,hat erfolgreich die Prüfung SP4 absolviert. Zeit: -","00:00:09.180",1]
[63," Maximilian","Herbst",63,"15:46:00,00","15:47:42,15","00:01:42,15","00:00:27,85","15:46:00,00","15:47:42,15","00:01:42.150","00:01:42.150","00:00:27.850","-","Fahrer"," ","mit der StartNr. ",",hat erfolgreich die Prüfung SP4 absolviert. Zeit:","Fahrer Maximilian Herbst mit der StartNr. 63 ,hat erfolgreich die Prüfung SP4 absolviert. Zeit: -","00:00:27.850",1]
[64," Jürgen","Buchhold",64,"16:16:00,00","16:17:40,26","00:01:40,26","00:00:29,74","16:16:00,00","16:17:40,26","00:01:40.260","00:01:40.260","00:00:29.740","-","Fahrer"," ","mit der StartNr. ",",hat erfolgreich die Prüfung SP4 absolviert. Zeit:","Fahrer Jürgen Buchhold mit der StartNr. 64 ,hat erfolgreich die Prüfung SP4 absolviert. Zeit: -","00:00:29.740",1]
[65," Oliver","Klink",65,"———","———","Keine Zeit","———","","","","",{"$f":"ABS(L67-$J$1)","v":{"$error":"#VALUE!"}},"","Fahrer"," ","mit der StartNr. ",",hat erfolgreich die Prüfung SP4 absolviert. Zeit:",{"$f":"IF(ISERROR(M67),\"\",O67&B67&P67&C67&P67&Q67&A67&P67&R67&P67&N67)","v":""},"",{"$f":"IF(T67=\"\",\"\",1)","v":""}]
[66," Peter","Bel",66,"16:06:00,00","16:07:50,48","00:01:50,48","00:00:19,52","16:06:00,00","16:07:50,48","00:01:50.480",{"$f":"IF(K68=\"\",\"\",J68-I68)","v":"00:01:50.480"},"00:00:19.520",{"$f":"IF(ISERROR(L68),\"\",IF(L68<=$J$1,\"-\",\"\"))","v":"-"},"Fahrer"," ","mit der StartNr. ",",hat erfolgreich die Prüfung SP4 absolviert. Zeit:","Fahrer Peter Bel mit der StartNr. 66 ,hat erfolgreich die Prüfung SP4 absolviert. Zeit: -",{"$f":"IF(ISERROR(M68),\"\",M68)","v":"00:00:19.520"},1]
[67," Thomas","Mirau",67,"16:05:00,00","16:07:11,13","00:02:11,13","00:00:01,13",{"$f":"IF(E69=\"———\",\"\",E69)","v":"16:05:00,00"},{"$f":"IF(F69=\"———\",\"\",F69)","v":"16:07:11,13"},"00:02:11.130","00:02:11.130","00:00:01.130","","Fahrer"," ","mit der StartNr. ",",hat erfolgreich die Prüfung SP4 absolviert. Zeit:","Fahrer Thomas Mirau mit der StartNr. 67 ,hat erfolgreich die Prüfung SP4 absolviert. Zeit: ","00:00:01.130",1]
[68," Markus","Gotta",68,"15:45:00,00","15:47:09,05","00:02:09,05","00:00:00,95","15:45:00,00","15:47:09,05",{"$f":"IF(I70=\"\",\"\",J70-I70)","v":"00:02:09.050"},"00:02:09.050","00:00:00.950","-","Fahrer"," ","mit der StartNr. ",",hat erfolgreich die Prüfung SP4 absolviert. Zeit:","Fahrer Markus Gotta mit der StartNr. 68 ,hat erfolgreich die Prüfung SP4 absolviert. Zeit: -","00:00:00.950",1]
[69," Robin","Keulertz",69,"16:15:00,00","16:17:10,45","00:02:10,45","00:00:00,95","16:15:00,00","16:17:10,45","00:02:10.450","00:02:10.450","00:00:00.450","","Fahrer"," ","mit der StartNr. ",",hat erfolgreich die Prüfung SP4 absolviert. Zeit:","Fahrer Robin Keulertz mit der StartNr. 69 ,hat erfolgreich die Prüfung SP4 absolviert. Zeit: ","00:00:00.450",1]
[70," Christian","Häp",70,"———","———","Keine Zeit","———","","","","",{"$error":"#VALUE!"},"","Fahrer"," ","mit der StartNr. ",",hat erfolgreich die Prüfung SP4 absolviert. Zeit:","","",""]
[71," Ingolf","Zschockelt",71,"16:00:00,00","16:02:09.500","00:02:09,50","00:00:00,50","16:00:00,00","16:02:09.500","00:02:09.500","00:02:09.500","00:00:00.500","-","Fahrer"," ","mit der StartNr. ",",hat erfolgreich die Prüfung SP4 absolviert. Zeit:","Fahrer Ingolf Zschockelt mit der StartNr. 71 ,hat erfolgreich die Prüfung SP4 absolviert. Zeit: -","00:00:00.500",1]
[72," Michael","Barsties",72,"———","———","Keine Zeit","———","","","","",{"$error":"#VALUE!"},"","Fahrer"," ","mit der StartNr. ",",hat erfolgreich die Prüfung SP4 absolviert. Zeit:","","",""]
[73," Ramona","Wagner",73,"16:17:00,00","16:19:23,60","00:02:23,60","00:00:13,60","16:17:00,00","16:19:23,60","00:02:23.600","00:02:23.600","00:00:13.600","","Fahrer"," ","mit der StartNr. ",",hat erfolgreich die Prüfung SP4 absolviert. Zeit:","Fahrer Ramona Wagner mit der StartNr. 73 ,hat erfolgreich die Prüfung SP4 absolviert. Zeit: ","00:00:13.600",1]
[74," Lars","Fahrenbach",74,"———","16:38:08,84","Keine Zeit","———","","16:38:08,84","","",{"$error":"#VALUE!"},"","Fahrer"," ","mit der StartNr. ",",hat erfolgreich die Prüfung SP4 absolviert. Zeit:","","",""]
[75," Frank","Hoefnagels",75,"15:56:00,00","15:58:10,55","00:02:10,55","00:00:13,60","15:56:00,00","15:58:10,55","00:02:10.550","00:02:10.550","00:00:00.550","","Fahrer"," ","mit der StartNr. ",",hat erfolgreich die Prüfung SP4 absolviert. Zeit:","Fahrer Frank Hoefnagels mit der StartNr. 75 ,hat erfolgreich die Prüfung SP4 absolviert. Zeit: ","00:00:00.550",1]
[76," Michael","Karch",76,"16:02:00,00","16:04:09,03","00:02:09,03","00:00:00,97","16:02:00,00","16:04:09,03","00:02:09.030","00:02:09.030","00:00:00.970","-","Fahrer"," ","mit der StartNr. ",",hat erfolgreich die Prüfung SP4 absolviert. Zeit:","Fahrer Michael Karch mit der StartNr. 76 ,hat erfolgreich die Prüfung SP4 absolviert. Zeit: -","00:00:00.970",1]
[77," Dirk","Götze",77,"16:18:00,00","16:20:10,06","00:02:10,06","00:00:00,97","16:18:00,00","16:20:10,06","00:02:10.060","00:02:10.060","00:00:00.060","","Fahrer"," ","mit der StartNr. ",",hat erfolgreich die Prüfung SP4 absolviert. Zeit:","Fahrer Dirk Götze mit der StartNr. 77 ,hat erfolgreich die Prüfung SP4 absolviert. Zeit: ","00:00:00.060",1]
[78," Stefan","Hillers",78,"16:21:00,00","16:23:11,28","00:02:11,28","00:00:01,28","16:21:00,00","16:23:11,28","00:02:11.280","00:02:11.280","00:00:01.280","","Fahrer"," ","mit der StartNr. ",",hat erfolgreich die Prüfung SP4 absolviert. Zeit:","Fahrer Stefan Hillers mit der StartNr. 78 ,hat erfolgreich die Prüfung SP4 absolviert. Zeit: ","00:00:01.280",1]
[79," Christian","Rafflenbeul",79,"16:04:00,00","16:06:11.440","00:02:11,44","00:59:58,56","16:04:00,00","16:06:11.440","00:02:11.440","00:02:11.440","00:00:01.440","","Fahrer"," ","mit der StartNr. ",",hat erfolgreich die Prüfung SP4 absolviert. Zeit:","Fahrer Christian Rafflenbeul mit der StartNr. 79 ,hat erfolgreich die Prüfung SP4 absolviert. Zeit: ","00:00:01.440",1]
[80," Gerhard","Reuschel",80,"16:12:30,00","16:14:37,93","00:02:07,93","00:00:02,07","16:12:30,00","16:14:37,93","00:02:07.930","00:02:07.930","00:00:02.070","-","Fahrer"," ","mit der StartNr. ",",hat erfolgreich die Prüfung SP4 absolviert. Zeit:","Fahrer Gerhard Reuschel mit der StartNr. 80 ,hat erfolgreich die Prüfung SP4 absolviert. Zeit: -","00:00:02.070",1]
[81," Karsten","Rachow",81,"16:14:00,00","16:16:10,57","00:02:10,57","00:00:02,07","16:14:00,00","16:16:10,57","00:02:10.570","00:02:10.570","00:00:00.570","","Fahrer"," ","mit der StartNr. ",",hat erfolgreich die Prüfung SP4 absolviert. Zeit:","Fahrer Karsten Rachow mit der StartNr. 81 ,hat erfolgreich die Prüfung SP4 absolviert. Zeit: ","00:00:00.570",1]
[82," Jürgen","Ziller",82,"———","———","Keine Zeit","———","","","","",{"$error":"#VALUE!"},"","Fahrer"," ","mit der StartNr. ",",hat erfolgreich die Prüfung SP4 absolviert. Zeit:","","",""]
[83," Alexander","Weil",83,"16:13:30,00","16:15:36,50","00:02:06,50","00:00:03,50","16:13:30,00","16:15:36,50","00:02:06.500","00:02:06.500","00:00:03.500","-","Fahrer"," ","mit der StartNr. ",",hat erfolgreich die Prüfung SP4 absolviert. Zeit:","Fahrer Alexander Weil mit der StartNr. 83 ,hat erfolgreich die Prüfung SP4 absolviert. Zeit: -","00:00:03.500",1]
[84," Josef","Lindenberger",84,"16:32:00,00","16:34:09,27","00:02:09,27","00:00:00,73","16:32:00,00","16:34:09,27","00:02:09.270","00:02:09.270","00:00:00.730","-","Fahrer"," ","mit der StartNr. ",",hat erfolgreich die Prüfung SP4 absolviert. Zeit:","Fahrer Josef Lindenberger mit der StartNr. 84 ,hat erfolgreich die Prüfung SP4 absolviert. Zeit: -","00:00:00.730",1]
[85," Rick","Durante",85,"16:11:30,00","16:13:16,66","00:01:46,66","00:00:23,34","16:11:30,00","16:13:16,66","00:01:46.660","00:01:46.660","00:00:23.340","-","Fahrer"," ","mit der StartNr. ",",hat erfolgreich die Prüfung SP4 absolviert. Zeit:","Fahrer Rick Durante mit der StartNr. 85 ,hat erfolgreich die Prüfung SP4 absolviert. Zeit: -","00:00:23.340",1]
[86," Almuth","Siemann",86,"16:10:00,00","16:12:09,49","00:02:09,49","00:00:00,51","16:10:00,00","16:12:09,49","00:02:09.490","00:02:09.490","00:00:00.510","-","Fahrer"," ","mit der StartNr. ",",hat erfolgreich die Prüfung SP4 absolviert. Zeit:","Fahrer Almuth Siemann mit der StartNr. 86 ,hat erfolgreich die Prüfung SP4 absolviert. Zeit: -","00:00:00.510",1]
[87," Axel","Strigl",87,"16:31:00,00","16:33:10,10","00:02:10,10","00:00:00,51","16:31:00,00","16:33:10,10","00:02:10.100","00:02:10.100","00:00:00.100","","Fahrer"," ","mit der StartNr. ",",hat erfolgreich die Prüfung SP4 absolviert. Zeit:","Fahrer Axel Strigl mit der StartNr. 87 ,hat erfolgreich die Prüfung SP4 absolviert. Zeit: ","00:00:00.100",1]
[88," Philip","Sommer",88,"15:48:00,00","15:50:10,18","00:02:10,18","00:00:00,51","15:48:00,00","15:50:10,18","00:02:10.180","00:02:10.180","00:00:00.180","","Fahrer"," ","mit der StartNr. ",",hat erfolgreich die Prüfung SP4 absolviert. Zeit:","Fahrer Philip Sommer mit der StartNr. 88 ,hat erfolgreich die Prüfung SP4 absolviert. Zeit: ","00:00:00.180",1]
[89," Jörg","Diehl",89,"16:30:00,00","16:33:17,54","00:03:17,54","00:01:07,54","16:30:00,00","16:33:17,54","00:03:17.540","00:03:17.540","00:01:07.540","","Fahrer"," ","mit der StartNr. ",",hat erfolgreich die Prüfung SP4 absolviert. Zeit:","Fahrer Jörg Diehl mit der StartNr. 89 ,hat erfolgreich die Prüfung SP4 absolviert. Zeit: ","00:01:07.540",1]
[90," Matthias","Herzig",90,"16:26:00,00","16:28:10,73","00:02:10,73","00:01:07,54","16:26:00,00","16:28:10,73","00:02:10.730","00:02:10.730","00:00:00.730","","Fahrer"," ","mit der StartNr. ",",hat erfolgreich die Prüfung SP4 absolviert. Zeit:","Fahrer Matthias Herzig mit der StartNr. 90 ,hat erfolgreich die Prüfung SP4 absolviert. Zeit: ","00:00:00.730",1]
[91," Christoph","Pasternak",91,"16:07:00,00","16:09:10,85","00:02:10,85","00:01:07,54","16:07:00,00","16:09:10,85","00:02:10.850","00:02:10.850","00:00:00.850","","Fahrer"," ","mit der StartNr. ",",hat erfolgreich die Prüfung SP4 absolviert. Zeit:","Fahrer Christoph Pasternak mit der StartNr. 91 ,hat erfolgreich die Prüfung SP4 absolviert. Zeit: ","00:00:00.850",1]
[92," Lothar","Schupet",92,"16:22:00,00","16:24:10,51","00:02:10,51","00:01:07,54","16:22:00,00","16:24:10,51","00:02:10.510","00:02:10.510","00:00:00.510","","Fahrer"," ","mit der StartNr. ",",hat erfolgreich die Prüfung SP4 absolviert. Zeit:","Fahrer Lothar Schupet mit der StartNr. 92 ,hat erfolgreich die Prüfung SP4 absolviert. Zeit: ","00:00:00.510",1]
[93," Wolfgang","Schertler",93,"16:20:00,00","16:21:49,21","00:01:49,21","00:00:20,79","16:20:00,00","16:21:49,21","00:01:49.210","00:01:49.210","00:00:20.790","-","Fahrer"," ","mit der StartNr. ",",hat erfolgreich die Prüfung SP4 absolviert. Zeit:","Fahrer Wolfgang Schertler mit der StartNr. 93 ,hat erfolgreich die Prüfung SP4 absolviert. Zeit: -","00:00:20.790",1]
[94," Thomas","Katzensteiner",94,"16:33:00,00","16:35:09,96","00:02:09,96","00:00:00,04","16:33:00,00","16:35:09,96","00:02:09.960","00:02:09.960","00:00:00.040","-","Fahrer"," ","mit der StartNr. ",",hat erfolgreich die Prüfung SP4 absolviert. Zeit:","Fahrer Thomas Katzensteiner mit der StartNr. 94 ,hat erfolgreich die Prüfung SP4 absolviert. Zeit: -","00:00:00.040",1]
[95," Hagen","Hackenberg",95,"16:27:00,00","16:29:08,84","00:02:08,84","00:00:01,16","16:27:00,00","16:29:08,84","00:02:08.840","00:02:08.840","00:00:01.160","-","Fahrer"," ","mit der StartNr. ",",hat erfolgreich die Prüfung SP4 absolviert. Zeit:","Fahrer Hagen Hackenberg mit der StartNr. 95 ,hat erfolgreich die Prüfung SP4 absolviert. Zeit: -","00:00:01.160",1]
[96," Oliver","Dietz",96,"16:28:00,00","16:30:10,59","00:02:10,59","00:00:01,16","16:28:00,00","16:30:10,59","00:02:10.590","00:02:10.590","00:00:00.590","","Fahrer"," ","mit der StartNr. ",",hat erfolgreich die Prüfung SP4 absolviert. Zeit:","Fahrer Oliver Dietz mit der StartNr. 96 ,hat erfolgreich die Prüfung SP4 absolviert. Zeit: ","00:00:00.590",1]
[97," Horst","Kempf",97,"———","16:58:08,41","Keine Zeit","———","","16:58:08,41","","",{"$error":"#VALUE!"},"","Fahrer"," ","mit der StartNr. ",",hat erfolgreich die Prüfung SP4 absolviert. Zeit:","","",""]
[98," Detlev","Pauer",98,"———","16:39:13,71","Keine Zeit","———","","16:39:13,71","","",{"$error":"#VALUE!"},"","Fahrer"," ","mit der StartNr. ",",hat erfolgreich die Prüfung SP4 absolviert. Zeit:","","",""]
[99," Dirk","Velte",99,"16:29:00,00","16:31:09,58","00:02:09,58","00:00:00,42","16:29:00,00","16:31:09,58","00:02:09.580","00:02:09.580","00:00:00.420","-","Fahrer"," ","mit der StartNr. ",",hat erfolgreich die Prüfung SP4 absolviert. Zeit:","Fahrer Dirk Velte mit der StartNr. 99 ,hat erfolgreich die Prüfung SP4 absolviert. Zeit: -","00:00:00.420",1]
[100," Thorsten","Krack",100,"16:11:00,00","16:13:09,31","00:02:09,31","00:00:00,69","16:11:00,00","16:13:09,31","00:02:09.310","00:02:09.310","00:00:00.690","-","Fahrer"," ","mit der StartNr. ",",hat erfolgreich die Prüfung SP4 absolviert. Zeit:","Fahrer Thorsten Krack mit der StartNr. 100 ,hat erfolgreich die Prüfung SP4 absolviert. Zeit: -","00:00:00.690",1]
[101," Christian","Wittek",101,"16:25:00,00","16:27:10,23","00:02:10,23","00:00:00,69","16:25:00,00","16:27:10,23","00:02:10.230","00:02:10.230","00:00:00.230","","Fahrer"," ","mit der StartNr. ",",hat erfolgreich die Prüfung SP4 absolviert. Zeit:","Fahrer Christian Wittek mit der StartNr. 101 ,hat erfolgreich die Prüfung SP4 absolviert. Zeit: ","00:00:00.230",1]
[102," Benjamin","Hix",102,"16:12:00,00","16:14:17,19","00:02:17,19","00:00:07,19","16:12:00,00","16:14:17,19","00:02:17.190","00:02:17.190","00:00:07.190","","Fahrer"," ","mit der StartNr. ",",hat erfolgreich die Prüfung SP4 absolviert. Zeit:","Fahrer Benjamin Hix mit der StartNr. 102 ,hat erfolgreich die Prüfung SP4 absolviert. Zeit: ","00:00:07.190",1]
[null,null,null,null,null,null,null,null,null,null,null,null,null,null,null,null,null,null,null,null,{"$f":"SUM(U3:U104)","v":72}]

{"sheet":"SP5_Sprint","index":4,"n_rows":104,"n_cols":18,"rows_kept":104,"cut":false,"hidden":false,"merged":[]}
[null,null,null,"#","Fahrtzeit","Abweichung","00:00:31","Diff.",null,null,null,null,null,null,"bitte auf das Vorzeichen \"-\" achten!","m:ss,00"]
[1," Christian","Jäger",1,"Keine Zeit","———","00:00:30.330",{"$f":"ABS(G2-$G$1)","v":"00:00:00.670"},{"$f":"IF(G2<=$G$1,\"-\",\"\")","v":"-"},"Fahrer"," ","mit der StartNr. ",",hat erfolgreich die Prüfung SP5 absolviert. Zeit:",{"$f":"J2&B2&K2&C2&K2&L2&A2&K2&M2","v":"Fahrer Christian Jäger mit der StartNr. 1 ,hat erfolgreich die Prüfung SP5 absolviert. Zeit:"},{"$f":"IF(ISERROR(H2),\"\",J2&B2&K2&C2&K2&L2&A2&K2&M2&K2&I2)","v":"Fahrer Christian Jäger mit der StartNr. 1 ,hat erfolgreich die Prüfung SP5 absolviert. Zeit: -"},{"$f":"IF(ISERROR(H2),\"\",H2)","v":"00:00:00.670"},{"$f":"IF(P2=\"\",\"\",1)","v":1},"x"]
[2," Daniel","Rinck",2,"Keine Zeit","———","00:00:30.750",{"$f":"ABS(G3-$G$1)","v":"00:00:00.250"},{"$f":"IF(G3<=$G$1,\"-\",\"\")","v":"-"},"Fahrer"," ","mit der StartNr. ",",hat erfolgreich die Prüfung SP5 absolviert. Zeit:",{"$f":"J3&B3&K3&C3&K3&L3&A3&K3&M3","v":"Fahrer Daniel Rinck mit der StartNr. 2 ,hat erfolgreich die Prüfung SP5 absolviert. Zeit:"},{"$f":"IF(ISERROR(H3),\"\",J3&B3&K3&C3&K3&L3&A3&K3&M3&K3&I3)","v":"Fahrer Daniel Rinck mit der StartNr. 2 ,hat erfolgreich die Prüfung SP5 absolviert. Zeit: -"},{"$f":"IF(ISERROR(H3),\"\",H3)","v":"00:00:00.250"},{"$f":"IF(P3=\"\",\"\",1)","v":1},1]
[3," Malte","Proff-Klein",3,"Keine Zeit","———","00:00:31.780","00:00:00.780","","Fahrer"," ","mit der StartNr. ",",hat erfolgreich die Prüfung SP5 absolviert. Zeit:","Fahrer Malte Proff-Klein mit der StartNr. 3 ,hat erfolgreich die Prüfung SP5 absolviert. Zeit:","Fahrer Malte Proff-Klein mit der StartNr. 3 ,hat erfolgreich die Prüfung SP5 absolviert. Zeit: ","00:00:00.780",1,1]
[4," Dietmar","Siemssen",4,"Keine Zeit","———","00:00:32.640","00:00:01.640","","Fahrer"," ","mit der StartNr. ",",hat erfolgreich die Prüfung SP5 absolviert. Zeit:","Fahrer Dietmar Siemssen mit der StartNr. 4 ,hat erfolgreich die Prüfung SP5 absolviert. Zeit:","Fahrer Dietmar Siemssen mit der StartNr. 4 ,hat erfolgreich die Prüfung SP5 absolviert. Zeit: ","00:00:01.640",1,1]
[5," Franz-Michael","Hartmann",5,"00:00:35,22","00:00:27.78","00:00:35.230","00:00:04.230","","Fahrer"," ","mit der StartNr. ",",hat erfolgreich die Prüfung SP5 absolviert. Zeit:","Fahrer Franz-Michael Hartmann mit der StartNr. 5 ,hat erfolgreich die Prüfung SP5 absolviert. Zeit:","Fahrer Franz-Michael Hartmann mit der StartNr. 5 ,hat erfolgreich die Prüfung SP5 absolviert. Zeit: ","00:00:04.230",1,1]
[6," Christoph","Schroer",6,"Keine Zeit","———","00:00:29.750","00:00:01.250","-","Fahrer"," ","mit der StartNr. ",",hat erfolgreich die Prüfung SP5 absolviert. Zeit:","Fahrer Christoph Schroer mit der StartNr. 6 ,hat erfolgreich die Prüfung SP5 absolviert. Zeit:","Fahrer Christoph Schroer mit der StartNr. 6 ,hat erfolgreich die Prüfung SP5 absolviert. Zeit: -","00:00:01.250",1,1]
[7," Jochen","Artzinger-Bolten",7,"Keine Zeit","———","00:00:30.280","00:00:00.720","-","Fahrer"," ","mit der StartNr. ",",hat erfolgreich die Prüfung SP5 absolviert. Zeit:","Fahrer Jochen Artzinger-Bolten mit der StartNr. 7 ,hat erfolgreich die Prüfung SP5 absolviert. Zeit:","Fahrer Jochen Artzinger-Bolten mit der StartNr. 7 ,hat erfolgreich die Prüfung SP5 absolviert. Zeit: -","00:00:00.720",1,1]
[8," Friedhelm","Eickhorn",8,"Keine Zeit","———","00:00:30.590","00:00:00.410","-","Fahrer"," ","mit der StartNr. ",",hat erfolgreich die Prüfung SP5 absolviert. Zeit:","Fahrer Friedhelm Eickhorn mit der StartNr. 8 ,hat erfolgreich die Prüfung SP5 absolviert. Zeit:","Fahrer Friedhelm Eickhorn mit der StartNr. 8 ,hat erfolgreich die Prüfung SP5 absolviert. Zeit: -","00:00:00.410",1,1]
[9," Carsten","Reblin",9,"Keine Zeit","———","00:00:30.850","00:00:00.150","-","Fahrer"," ","mit der StartNr. ",",hat erfolgreich die Prüfung SP5 absolviert. Zeit:","Fahrer Carsten Reblin mit der StartNr. 9 ,hat erfolgreich die Prüfung SP5 absolviert. Zeit:","Fahrer Carsten Reblin mit der StartNr. 9 ,hat erfolgreich die Prüfung SP5 absolviert. Zeit: -","00:00:00.150",1,1]
[10," Dieter","Dinges",10,"Keine Zeit","———","00:00:34.030","00:00:03.030","","Fahrer"," ","mit der StartNr. ",",hat erfolgreich die Prüfung SP5 absolviert. Zeit:","Fahrer Dieter Dinges mit der StartNr. 10 ,hat erfolgreich die Prüfung SP5 absolviert. Zeit:","Fahrer Dieter Dinges mit der StartNr. 10 ,hat erfolgreich die Prüfung SP5 absolviert. Zeit: ","00:00:03.030",1,1]
[11," Wolfgang","Reeh",11,"Keine Zeit","———","00:00:31.080","00:00:00.080","","Fahrer"," ","mit der StartNr. ",",hat erfolgreich die Prüfung SP5 absolviert. Zeit:","Fahrer Wolfgang Reeh mit der StartNr. 11 ,hat erfolgreich die Prüfung SP5 absolviert. Zeit:","Fahrer Wolfgang Reeh mit der StartNr. 11 ,hat erfolgreich die Prüfung SP5 absolviert. Zeit: ","00:00:00.080",1,1]
[12," Andreas","Petry",12,"Keine Zeit","———","00:00:29.820","00:00:01.180","-","Fahrer"," ","mit der StartNr. ",",hat erfolgreich die Prüfung SP5 absolviert. Zeit:","Fahrer Andreas Petry mit der StartNr. 12 ,hat erfolgreich die Prüfung SP5 absolviert. Zeit:","Fahrer Andreas Petry mit der StartNr. 12 ,hat erfolgreich die Prüfung SP5 absolviert. Zeit: -","00:00:01.180",1,1]
[13," Ted","Prenzel",13,"Keine Zeit","———","00:00:30.110","00:00:00.890","-","Fahrer"," ","mit der StartNr. ",",hat erfolgreich die Prüfung SP5 absolviert. Zeit:","Fahrer Ted Prenzel mit der StartNr. 13 ,hat erfolgreich die Prüfung SP5 absolviert. Zeit:","Fahrer Ted Prenzel mit der StartNr. 13 ,hat erfolgreich die Prüfung SP5 absolviert. Zeit: -","00:00:00.890",1,1]
[14," Micha","Barsties",14,"Keine Zeit","———","00:00:33.950","00:00:02.950","","Fahrer"," ","mit der StartNr. ",",hat erfolgreich die Prüfung SP5 absolviert. Zeit:","Fahrer Micha Barsties mit der StartNr. 14 ,hat erfolgreich die Prüfung SP5 absolviert. Zeit:","Fahrer Micha Barsties mit der StartNr. 14 ,hat erfolgreich die Prüfung SP5 absolviert. Zeit: ","00:00:02.950",1,1]
[15," Klaus","Flettner",15,"Keine Zeit","———","00:00:31.860","00:00:00.860","","Fahrer"," ","mit der StartNr. ",",hat erfolgreich die Prüfung SP5 absolviert. Zeit:","Fahrer Klaus Flettner mit der StartNr. 15 ,hat erfolgreich die Prüfung SP5 absolviert. Zeit:","Fahrer Klaus Flettner mit der StartNr. 15 ,hat erfolgreich die Prüfung SP5 absolviert. Zeit: ","00:00:00.860",1,1]
[16," Heinz","Frey",16,"Keine Zeit","———","00:00:31.290","00:00:00.290","","Fahrer"," ","mit der StartNr. ",",hat erfolgreich die Prüfung SP5 absolviert. Zeit:","Fahrer Heinz Frey mit der StartNr. 16 ,hat erfolgreich die Prüfung SP5 absolviert. Zeit:","Fahrer Heinz Frey mit der StartNr. 16 ,hat erfolgreich die Prüfung SP5 absolviert. Zeit: ","00:00:00.290",1,1]
[17," Henning","Reichel",17,"Keine Zeit","———","00:00:31.270","00:00:00.270","","Fahrer"," ","mit der StartNr. ",",hat erfolgreich die Prüfung SP5 absolviert. Zeit:","Fahrer Henning Reichel mit der StartNr. 17 ,hat erfolgreich die Prüfung SP5 absolviert. Zeit:","Fahrer Henning Reichel mit der StartNr. 17 ,hat erfolgreich die Prüfung SP5 absolviert. Zeit: ","00:00:00.270",1,1]
[18," Maik","Käbisch",18,"Keine Zeit","———","00:00:31.970","00:00:00.970","","Fahrer"," ","mit der StartNr. ",",hat erfolgreich die Prüfung SP5 absolviert. Zeit:","Fahrer Maik Käbisch mit der StartNr. 18 ,hat erfolgreich die Prüfung SP5 absolviert. Zeit:","Fahrer Maik Käbisch mit der StartNr. 18 ,hat erfolgreich die Prüfung SP5 absolviert. Zeit: ","00:00:00.970",1,1]
[19," Harald","Zapp",19,"Keine Zeit","———",null,null,null,null,null,null,null,null,null,null,{"$f":"IF(P20=\"\",\"\",1)","v":""}]
[20," Reinhard","Grzesik",20,"Keine Zeit","———","00:00:32.610","00:00:01.610","","Fahrer"," ","mit der StartNr. ",",hat erfolgreich die Prüfung SP5 absolviert. Zeit:","Fahrer Reinhard Grzesik mit der StartNr. 20 ,hat erfolgreich die Prüfung SP5 absolviert. Zeit:","Fahrer Reinhard Grzesik mit der StartNr. 20 ,hat erfolgreich die Prüfung SP5 absolviert. Zeit: ","00:00:01.610",1,1]
[21," Jörg","Sihler",21,"Keine Zeit","———","00:00:34.970","00:00:03.970","","Fahrer"," ","mit der StartNr. ",",hat erfolgreich die Prüfung SP5 absolviert. Zeit:","Fahrer Jörg Sihler mit der StartNr. 21 ,hat erfolgreich die Prüfung SP5 absolviert. Zeit:","Fahrer Jörg Sihler mit der StartNr. 21 ,hat erfolgreich die Prüfung SP5 absolviert. Zeit: ","00:00:03.970",1,1]
[22," Ingo","Winterstein",22,"Keine Zeit","———","00:00:30.660","00:00:00.340","-","Fahrer"," ","mit der StartNr. ",",hat erfolgreich die Prüfung SP5 absolviert. Zeit:","Fahrer Ingo Winterstein mit der StartNr. 22 ,hat erfolgreich die Prüfung SP5 absolviert. Zeit:","Fahrer Ingo Winterstein mit der StartNr. 22 ,hat erfolgreich die Prüfung SP5 absolviert. Zeit: -","00:00:00.340",1,1]
[23," Hans Werner","Melchior",23,"Keine Zeit","———","00:00:31.930","00:00:00.930","","Fahrer"," ","mit der StartNr. ",",hat erfolgreich die Prüfung SP5 absolviert. Zeit:","Fahrer Hans Werner Melchior mit der StartNr. 23 ,hat erfolgreich die Prüfung SP5 absolviert. Zeit:","Fahrer Hans Werner Melchior mit der StartNr. 23 ,hat erfolgreich die Prüfung SP5 absolviert. Zeit: ","00:00:00.930",1,1]
[24," Marco","Oriolo",24,"Keine Zeit","———","00:00:33.900","00:00:02.900","","Fahrer"," ","mit der StartNr. ",",hat erfolgreich die Prüfung SP5 absolviert. Zeit:","Fahrer Marco Oriolo mit der StartNr. 24 ,hat erfolgreich die Prüfung SP5 absolviert. Zeit:","Fahrer Marco Oriolo mit der StartNr. 24 ,hat erfolgreich die Prüfung SP5 absolviert. Zeit: ","00:00:02.900",1,1]
[25," Manfred","Stommel",25,"00:00:35,92","00:00:27.08",{"$f":"IF(E26=\"Keine Zeit\",\"\",E26)","v":"00:00:35,92"},"00:00:04.920","","Fahrer"," ","mit der StartNr. ",",hat erfolgreich die Prüfung SP5 absolviert. Zeit:","Fahrer Manfred Stommel mit der StartNr. 25 ,hat erfolgreich die Prüfung SP5 absolviert. Zeit:","Fahrer Manfred Stommel mit der StartNr. 25 ,hat erfolgreich die Prüfung SP5 absolviert. Zeit: ","00:00:04.920",1,1]
[26," Carolin","Heusel",26,"Keine Zeit","———","00:00:30.840","00:00:00.160","-","Fahrer"," ","mit der StartNr. ",",hat erfolgreich die Prüfung SP5 absolviert. Zeit:","Fahrer Carolin Heusel mit der StartNr. 26 ,hat erfolgreich die Prüfung SP5 absolviert. Zeit:","Fahrer Carolin Heusel mit der StartNr. 26 ,hat erfolgreich die Prüfung SP5 absolviert. Zeit: -","00:00:00.160",1,1]
[27," Regina","Philippi",27,"Keine Zeit","———","00:00:34.520","00:00:03.520","","Fahrer"," ","mit der StartNr. ",",hat erfolgreich die Prüfung SP5 absolviert. Zeit:","Fahrer Regina Philippi mit der StartNr. 27 ,hat erfolgreich die Prüfung SP5 absolviert. Zeit:","Fahrer Regina Philippi mit der StartNr. 27 ,hat erfolgreich die Prüfung SP5 absolviert. Zeit: ","00:00:03.520",1,1]
[28," Christof","Aha",28,"Keine Zeit","———","00:00:33.010","00:00:02.010","","Fahrer"," ","mit der StartNr. ",",hat erfolgreich die Prüfung SP5 absolviert. Zeit:","Fahrer Christof Aha mit der StartNr. 28 ,hat erfolgreich die Prüfung SP5 absolviert. Zeit:","Fahrer Christof Aha mit der StartNr. 28 ,hat erfolgreich die Prüfung SP5 absolviert. Zeit: ","00:00:02.010",1,1]
[29," Dennis","Weiss",29,"Keine Zeit","———","00:00:35.440","00:00:04.440","","Fahrer"," ","mit der StartNr. ",",hat erfolgreich die Prüfung SP5 absolviert. Zeit:","Fahrer Dennis Weiss mit der StartNr. 29 ,hat erfolgreich die Prüfung SP5 absolviert. Zeit:","Fahrer Dennis Weiss mit der StartNr. 29 ,hat erfolgreich die Prüfung SP5 absolviert. Zeit: ","00:00:04.440",1,1]
[30," Harald","Hamprecht",30,"Keine Zeit","———","00:00:30.270","00:00:00.730","-","Fahrer"," ","mit der StartNr. ",",hat erfolgreich die Prüfung SP5 absolviert. Zeit:","Fahrer Harald Hamprecht mit der StartNr. 30 ,hat erfolgreich die Prüfung SP5 absolviert. Zeit:","Fahrer Harald Hamprecht mit der StartNr. 30 ,hat erfolgreich die Prüfung SP5 absolviert. Zeit: -","00:00:00.730",1,1]
[31," Reno","Fiolic",31,"Keine Zeit","———","00:00:33.460","00:00:02.460","","Fahrer"," ","mit der StartNr. ",",hat erfolgreich die Prüfung SP5 absolviert. Zeit:","Fahrer Reno Fiolic mit der StartNr. 31 ,hat erfolgreich die Prüfung SP5 absolviert. Zeit:","Fahrer Reno Fiolic mit der StartNr. 31 ,hat erfolgreich die Prüfung SP5 absolviert. Zeit: ","00:00:02.460",1,1]
[32," Jürgen","Kulpe",32,"00:00:30,69","00:00:27.31","00:00:30,69","00:00:00.310","","Fahrer"," ","mit der StartNr. ",",hat erfolgreich die Prüfung SP5 absolviert. Zeit:","Fahrer Jürgen Kulpe mit der StartNr. 32 ,hat erfolgreich die Prüfung SP5 absolviert. Zeit:","Fahrer Jürgen Kulpe mit der StartNr. 32 ,hat erfolgreich die Prüfung SP5 absolviert. Zeit: ","00:00:00.310",1,1]
[33," Konstantin","Kovarbasic",33,"00:00:31,25","00:00:27.75","00:00:31,25","00:00:00.250","","Fahrer"," ","mit der StartNr. ",",hat erfolgreich die Prüfung SP5 absolviert. Zeit:","Fahrer Konstantin Kovarbasic mit der StartNr. 33 ,hat erfolgreich die Prüfung SP5 absolviert. Zeit:","Fahrer Konstantin Kovarbasic mit der StartNr. 33 ,hat erfolgreich die Prüfung SP5 absolviert. Zeit: ","00:00:00.250",1,1]
[34," Nikolaus","Kratz",34,"Keine Zeit","———","00:00:31.710","00:00:00.710","","Fahrer"," ","mit der StartNr. ",",hat erfolgreich die Prüfung SP5 absolviert. Zeit:","Fahrer Nikolaus Kratz mit der StartNr. 34 ,hat erfolgreich die Prüfung SP5 absolviert. Zeit:","Fahrer Nikolaus Kratz mit der StartNr. 34 ,hat erfolgreich die Prüfung SP5 absolviert. Zeit: ","00:00:00.710",1,1]
[35," Andreas","Eberhardt",35,"Keine Zeit","———","00:00:31.520","00:00:00.520","","Fahrer"," ","mit der StartNr. ",",hat erfolgreich die Prüfung SP5 absolviert. Zeit:","Fahrer Andreas Eberhardt mit der StartNr. 35 ,hat erfolgreich die Prüfung SP5 absolviert. Zeit:","Fahrer Andreas Eberhardt mit der StartNr. 35 ,hat erfolgreich die Prüfung SP5 absolviert. Zeit: ","00:00:00.520",1,1]
[36," Gerhard","Thomas",36,"Keine Zeit","———","00:00:30.790","00:00:00.210","-","Fahrer"," ","mit der StartNr. ",",hat erfolgreich die Prüfung SP5 absolviert. Zeit:","Fahrer Gerhard Thomas mit der StartNr. 36 ,hat erfolgreich die Prüfung SP5 absolviert. Zeit:","Fahrer Gerhard Thomas mit der StartNr. 36 ,hat erfolgreich die Prüfung SP5 absolviert. Zeit: -","00:00:00.210",1,1]
[37," Lotzi","Kende",37,"Keine Zeit","———","00:00:30.960","00:00:00.040","-","Fahrer"," ","mit der StartNr. ",",hat erfolgreich die Prüfung SP5 absolviert. Zeit:","Fahrer Lotzi Kende mit der StartNr. 37 ,hat erfolgreich die Prüfung SP5 absolviert. Zeit:","Fahrer Lotzi Kende mit der StartNr. 37 ,hat erfolgreich die Prüfung SP5 absolviert. Zeit: -","00:00:00.040",1,1]
[38," Jockel","Winkelhock",38,"00:00:30,58","00:00:27.42","00:00:30,58","00:00:00.420","","Fahrer"," ","mit der StartNr. ",",hat erfolgreich die Prüfung SP5 absolviert. Zeit:","Fahrer Jockel Winkelhock mit der StartNr. 38 ,hat erfolgreich die Prüfung SP5 absolviert. Zeit:","Fahrer Jockel Winkelhock mit der StartNr. 38 ,hat erfolgreich die Prüfung SP5 absolviert. Zeit: ","00:00:00.420",1,1]
[39," Sascha","Wilkesmann",39,"Keine Zeit","———","00:00:28.700","00:00:02.300","-","Fahrer"," ","mit der StartNr. ",",hat erfolgreich die Prüfung SP5 absolviert. Zeit:","Fahrer Sascha Wilkesmann mit der StartNr. 39 ,hat erfolgreich die Prüfung SP5 absolviert. Zeit:","Fahrer Sascha Wilkesmann mit der StartNr. 39 ,hat erfolgreich die Prüfung SP5 absolviert. Zeit: -","00:00:02.300",1,1]
[40," Gregor","Schulz",40,"Keine Zeit","———","00:00:36.450","00:00:05.450","","Fahrer"," ","mit der StartNr. ",",hat erfolgreich die Prüfung SP5 absolviert. Zeit:","Fahrer Gregor Schulz mit der StartNr. 40 ,hat erfolgreich die Prüfung SP5 absolviert. Zeit:","Fahrer Gregor Schulz mit der StartNr. 40 ,hat erfolgreich die Prüfung SP5 absolviert. Zeit: ","00:00:05.450",1,"x"]
[41," Peer","Hildmann",41,"Keine Zeit","———","00:00:30.600","00:00:00.400","-","Fahrer"," ","mit der StartNr. ",",hat erfolgreich die Prüfung SP5 absolviert. Zeit:","Fahrer Peer Hildmann mit der StartNr. 41 ,hat erfolgreich die Prüfung SP5 absolviert. Zeit:","Fahrer Peer Hildmann mit der StartNr. 41 ,hat erfolgreich die Prüfung SP5 absolviert. Zeit: -","00:00:00.400",1,"x"]
[42," Mina","Tander",42,"00:00:30,61","00:00:27.39","00:00:30,61","00:00:00.390","","Fahrer"," ","mit der StartNr. ",",hat erfolgreich die Prüfung SP5 absolviert. Zeit:","Fahrer Mina Tander mit der StartNr. 42 ,hat erfolgreich die Prüfung SP5 absolviert. Zeit:","Fahrer Mina Tander mit der StartNr. 42 ,hat erfolgreich die Prüfung SP5 absolviert. Zeit: ","00:00:00.390",1,1]
[43," Stefan","Iskan",43,"Keine Zeit","———","",{"$error":"#VALUE!"},"","Fahrer"," ","mit der StartNr. ",",hat erfolgreich die Prüfung SP5 absolviert. Zeit:","Fahrer Stefan Iskan mit der StartNr. 43 ,hat erfolgreich die Prüfung SP5 absolviert. Zeit:","","",""]
[44," Jean-Philippe","Kempf",44,"Keine Zeit","———","00:00:29.180","00:00:01.820","-","Fahrer"," ","mit der StartNr. ",",hat erfolgreich die Prüfung SP5 absolviert. Zeit:","Fahrer Jean-Philippe Kempf mit der StartNr. 44 ,hat erfolgreich die Prüfung SP5 absolviert. Zeit:","Fahrer Jean-Philippe Kempf mit der StartNr. 44 ,hat erfolgreich die Prüfung SP5 absolviert. Zeit: -","00:00:01.820",1,1]
[45," Daniel","Martin",45,"Keine Zeit","———","00:00:30.480","00:00:00.520","-","Fahrer"," ","mit der StartNr. ",",hat erfolgreich die Prüfung SP5 absolviert. Zeit:","Fahrer Daniel Martin mit der StartNr. 45 ,hat erfolgreich die Prüfung SP5 absolviert. Zeit:","Fahrer Daniel Martin mit der StartNr. 45 ,hat erfolgreich die Prüfung SP5 absolviert. Zeit: -","00:00:00.520",1,1]
[46," Elena","Funk",46,"Keine Zeit","———","00:00:30.070","00:00:00.930","-","Fahrer"," ","mit der StartNr. ",",hat erfolgreich die Prüfung SP5 absolviert. Zeit:","Fahrer Elena Funk mit der StartNr. 46 ,hat erfolgreich die Prüfung SP5 absolviert. Zeit:","Fahrer Elena Funk mit der StartNr. 46 ,hat erfolgreich die Prüfung SP5 absolviert. Zeit: -","00:00:00.930",1,1]
[47," Hans","Mutschall",47,"Keine Zeit","———","00:00:31.360","00:00:00.360","","Fahrer"," ","mit der StartNr. ",",hat erfolgreich die Prüfung SP5 absolviert. Zeit:","Fahrer Hans Mutschall mit der StartNr. 47 ,hat erfolgreich die Prüfung SP5 absolviert. Zeit:","Fahrer Hans Mutschall mit der StartNr. 47 ,hat erfolgreich die Prüfung SP5 absolviert. Zeit: ","00:00:00.360",1,1]
[48," Kahled","Rahman",48,"Keine Zeit","———","00:00:49.770","00:00:18.770","","Fahrer"," ","mit der StartNr. ",",hat erfolgreich die Prüfung SP5 absolviert. Zeit:","Fahrer Kahled Rahman mit der StartNr. 48 ,hat erfolgreich die Prüfung SP5 absolviert. Zeit:","Fahrer Kahled Rahman mit der StartNr. 48 ,hat erfolgreich die Prüfung SP5 absolviert. Zeit: ","00:00:18.770",1,1]
[49," Jochen","Schwarz",49,"Keine Zeit","———","00:00:30.960","00:00:00.040","-","Fahrer"," ","mit der StartNr. ",",hat erfolgreich die Prüfung SP5 absolviert. Zeit:","Fahrer Jochen Schwarz mit der StartNr. 49 ,hat erfolgreich die Prüfung SP5 absolviert. Zeit:","Fahrer Jochen Schwarz mit der StartNr. 49 ,hat erfolgreich die Prüfung SP5 absolviert. Zeit: -","00:00:00.040",1,1]
[50," Axel","Nawrath",50,"00:00:35,41","00:00:27.59","00:00:35,41","00:00:04.410","","Fahrer"," ","mit der StartNr. ",",hat erfolgreich die Prüfung SP5 absolviert. Zeit:","Fahrer Axel Nawrath mit der StartNr. 50 ,hat erfolgreich die Prüfung SP5 absolviert. Zeit:","Fahrer Axel Nawrath mit der StartNr. 50 ,hat erfolgreich die Prüfung SP5 absolviert. Zeit: ","00:00:04.410",1,1]
[51," Birgit","Claussen",51,"Keine Zeit","———","00:00:33.390","00:00:02.390","","Fahrer"," ","mit der StartNr. ",",hat erfolgreich die Prüfung SP5 absolviert. Zeit:","Fahrer Birgit Claussen mit der StartNr. 51 ,hat erfolgreich die Prüfung SP5 absolviert. Zeit:","Fahrer Birgit Claussen mit der StartNr. 51 ,hat erfolgreich die Prüfung SP5 absolviert. Zeit: ","00:00:02.390",1,1]
[52," Harald","König",52,"Keine Zeit","———","00:00:34.210","00:00:03.210","","Fahrer"," ","mit der StartNr. ",",hat erfolgreich die Prüfung SP5 absolviert. Zeit:","Fahrer Harald König mit der StartNr. 52 ,hat erfolgreich die Prüfung SP5 absolviert. Zeit:","Fahrer Harald König mit der StartNr. 52 ,hat erfolgreich die Prüfung SP5 absolviert. Zeit: ","00:00:03.210",1,1]
[53," Thomas","Blank",53,"Keine Zeit","———","00:00:30.380","00:00:00.620","-","Fahrer"," ","mit der StartNr. ",",hat erfolgreich die Prüfung SP5 absolviert. Zeit:","Fahrer Thomas Blank mit der StartNr. 53 ,hat erfolgreich die Prüfung SP5 absolviert. Zeit:","Fahrer Thomas Blank mit der StartNr. 53 ,hat erfolgreich die Prüfung SP5 absolviert. Zeit: -","00:00:00.620",1,1]
[54," Heidi","Eberhardt",54,"Keine Zeit","———","00:00:30.960","00:00:00.040","-","Fahrer"," ","mit der StartNr. ",",hat erfolgreich die Prüfung SP5 absolviert. Zeit:","Fahrer Heidi Eberhardt mit der StartNr. 54 ,hat erfolgreich die Prüfung SP5 absolviert. Zeit:","Fahrer Heidi Eberhardt mit der StartNr. 54 ,hat erfolgreich die Prüfung SP5 absolviert. Zeit: -","00:00:00.040",1,1]
[55," Karina","Ansos",55,"Keine Zeit","———","00:00:30.770","00:00:00.230","-","Fahrer"," ","mit der StartNr. ",",hat erfolgreich die Prüfung SP5 absolviert. Zeit:","Fahrer Karina Ansos mit der StartNr. 55 ,hat erfolgreich die Prüfung SP5 absolviert. Zeit:","Fahrer Karina Ansos mit der StartNr. 55 ,hat erfolgreich die Prüfung SP5 absolviert. Zeit: -","00:00:00.230",1,1]
[56," Michael","Gotta",56,"Keine Zeit","———","00:00:31.370","00:00:00.370","","Fahrer"," ","mit der StartNr. ",",hat erfolgreich die Prüfung SP5 absolviert. Zeit:","Fahrer Michael Gotta mit der StartNr. 56 ,hat erfolgreich die Prüfung SP5 absolviert. Zeit:","Fahrer Michael Gotta mit der StartNr. 56 ,hat erfolgreich die Prüfung SP5 absolviert. Zeit: ","00:00:00.370",1,1]
[57," Stefanie","Rinck",57,"Keine Zeit","———","00:00:29","00:00:02","-","Fahrer"," ","mit der StartNr. ",",hat erfolgreich die Prüfung SP5 absolviert. Zeit:","Fahrer Stefanie Rinck mit der StartNr. 57 ,hat erfolgreich die Prüfung SP5 absolviert. Zeit:","Fahrer Stefanie Rinck mit der StartNr. 57 ,hat erfolgreich die Prüfung SP5 absolviert. Zeit: -","00:00:02",1,1]
[58," Armin","Slotta",58,"Keine Zeit","———","00:00:31.180","00:00:00.180","","Fahrer"," ","mit der StartNr. ",",hat erfolgreich die Prüfung SP5 absolviert. Zeit:","Fahrer Armin Slotta mit der StartNr. 58 ,hat erfolgreich die Prüfung SP5 absolviert. Zeit:","Fahrer Armin Slotta mit der StartNr. 58 ,hat erfolgreich die Prüfung SP5 absolviert. Zeit: ","00:00:00.180",1,1]
[59," Julia","Kende",59,"Keine Zeit","———","00:00:30.880","00:00:00.120","-","Fahrer"," ","mit der StartNr. ",",hat erfolgreich die Prüfung SP5 absolviert. Zeit:","Fahrer Julia Kende mit der StartNr. 59 ,hat erfolgreich die Prüfung SP5 absolviert. Zeit:","Fahrer Julia Kende mit der StartNr. 59 ,hat erfolgreich die Prüfung SP5 absolviert. Zeit: -","00:00:00.120",1,1]
[60," Robert","Bleckmann",60,"Keine Zeit","———","00:00:32.010","00:00:01.010","","Fahrer"," ","mit der StartNr. ",",hat erfolgreich die Prüfung SP5 absolviert. Zeit:","Fahrer Robert Bleckmann mit der StartNr. 60 ,hat erfolgreich die Prüfung SP5 absolviert. Zeit:","Fahrer Robert Bleckmann mit der StartNr. 60 ,hat erfolgreich die Prüfung SP5 absolviert. Zeit: ","00:00:01.010",1,1]
[61," Christof","Harwardt",61,"Keine Zeit","———","00:00:32.260","00:00:01.260","","Fahrer"," ","mit der StartNr. ",",hat erfolgreich die Prüfung SP5 absolviert. Zeit:","Fahrer Christof Harwardt mit der StartNr. 61 ,hat erfolgreich die Prüfung SP5 absolviert. Zeit:","Fahrer Christof Harwardt mit der StartNr. 61 ,hat erfolgreich die Prüfung SP5 absolviert. Zeit: ","00:00:01.260",1,1]
[62," Thomas","Kahns",62,"Keine Zeit","———","00:00:33.960","00:00:02.960","","Fahrer"," ","mit der StartNr. ",",hat erfolgreich die Prüfung SP5 absolviert. Zeit:","Fahrer Thomas Kahns mit der StartNr. 62 ,hat erfolgreich die Prüfung SP5 absolviert. Zeit:","Fahrer Thomas Kahns mit der StartNr. 62 ,hat erfolgreich die Prüfung SP5 absolviert. Zeit: ","00:00:02.960",1,1]
[63," Maximilian","Herbst",63,"Keine Zeit","———","00:00:31.180","00:00:00.180","","Fahrer"," ","mit der StartNr. ",",hat erfolgreich die Prüfung SP5 absolviert. Zeit:","Fahrer Maximilian Herbst mit der StartNr. 63 ,hat erfolgreich die Prüfung SP5 absolviert. Zeit:","Fahrer Maximilian Herbst mit der StartNr. 63 ,hat erfolgreich die Prüfung SP5 absolviert. Zeit: ","00:00:00.180",1,1]
[64," Jürgen","Buchhold",64,"Keine Zeit","———","00:00:30.760","00:00:00.240","-","Fahrer"," ","mit der StartNr. ",",hat erfolgreich die Prüfung SP5 absolviert. Zeit:","Fahrer Jürgen Buchhold mit der StartNr. 64 ,hat erfolgreich die Prüfung SP5 absolviert. Zeit:","Fahrer Jürgen Buchhold mit der StartNr. 64 ,hat erfolgreich die Prüfung SP5 absolviert. Zeit: -","00:00:00.240",1,1]
[65," Oliver","Klink",65,"Keine Zeit","———","",{"$error":"#VALUE!"},"","Fahrer"," ","mit der StartNr. ",",hat erfolgreich die Prüfung SP5 absolviert. Zeit:","Fahrer Oliver Klink mit der StartNr. 65 ,hat erfolgreich die Prüfung SP5 absolviert. Zeit:","","",""]
[66," Peter","Bel",66,"Keine Zeit","———","00:00:31.840",{"$f":"ABS(G67-$G$1)","v":"00:00:00.840"},{"$f":"IF(G67<=$G$1,\"-\",\"\")","v":""},"Fahrer"," ","mit der StartNr. ",",hat erfolgreich die Prüfung SP5 absolviert. Zeit:",{"$f":"J67&B67&K67&C67&K67&L67&A67&K67&M67","v":"Fahrer Peter Bel mit der StartNr. 66 ,hat erfolgreich die Prüfung SP5 absolviert. Zeit:"},{"$f":"IF(ISERROR(H67),\"\",J67&B67&K67&C67&K67&L67&A67&K67&M67&K67&I67)","v":"Fahrer Peter Bel mit der StartNr. 66 ,hat erfolgreich die Prüfung SP5 absolviert. Zeit: "},{"$f":"IF(ISERROR(H67),\"\",H67)","v":"00:00:00.840"},{"$f":"IF(P67=\"\",\"\",1)","v":1},1]
[67," Thomas","Mirau",67,"Keine Zeit","———","00:00:35.690","00:00:04.690","","Fahrer"," ","mit der StartNr. ",",hat erfolgreich die Prüfung SP5 absolviert. Zeit:","Fahrer Thomas Mirau mit der StartNr. 67 ,hat erfolgreich die Prüfung SP5 absolviert. Zeit:","Fahrer Thomas Mirau mit der StartNr. 67 ,hat erfolgreich die Prüfung SP5 absolviert. Zeit: ","00:00:04.690",1,1]
[68," Markus","Gotta",68,"Keine Zeit","———","00:00:32.310","00:00:01.310","","Fahrer"," ","mit der StartNr. ",",hat erfolgreich die Prüfung SP5 absolviert. Zeit:","Fahrer Markus Gotta mit der StartNr. 68 ,hat erfolgreich die Prüfung SP5 absolviert. Zeit:","Fahrer Markus Gotta mit der StartNr. 68 ,hat erfolgreich die Prüfung SP5 absolviert. Zeit: ","00:00:01.310",1,1]
[69," Robin","Keulertz",69,"Keine Zeit","———","00:00:31.990","00:00:00.990","","Fahrer"," ","mit der StartNr. ",",hat erfolgreich die Prüfung SP5 absolviert. Zeit:","Fahrer Robin Keulertz mit der StartNr. 69 ,hat erfolgreich die Prüfung SP5 absolviert. Zeit:","Fahrer Robin Keulertz mit der StartNr. 69 ,hat erfolgreich die Prüfung SP5 absolviert. Zeit: ","00:00:00.990",1,1]
[70," Christian","Häp",70,"Keine Zeit","———","00:00:30.040","00:00:00.960","-","Fahrer"," ","mit der StartNr. ",",hat erfolgreich die Prüfung SP5 absolviert. Zeit:","Fahrer Christian Häp mit der StartNr. 70 ,hat erfolgreich die Prüfung SP5 absolviert. Zeit:","Fahrer Christian Häp mit der StartNr. 70 ,hat erfolgreich die Prüfung SP5 absolviert. Zeit: -","00:00:00.960",1,1]
[71," Ingolf","Zschockelt",71,"Keine Zeit","———","00:00:31.470","00:00:00.470","","Fahrer"," ","mit der StartNr. ",",hat erfolgreich die Prüfung SP5 absolviert. Zeit:","Fahrer Ingolf Zschockelt mit der StartNr. 71 ,hat erfolgreich die Prüfung SP5 absolviert. Zeit:","Fahrer Ingolf Zschockelt mit der StartNr. 71 ,hat erfolgreich die Prüfung SP5 absolviert. Zeit: ","00:00:00.470",1,1]
[72," Michael","Barsties",72,"Keine Zeit","———","00:00:30.260","00:00:00.740","-","Fahrer"," ","mit der StartNr. ",",hat erfolgreich die Prüfung SP5 absolviert. Zeit:","Fahrer Michael Barsties mit der StartNr. 72 ,hat erfolgreich die Prüfung SP5 absolviert. Zeit:","Fahrer Michael Barsties mit der StartNr. 72 ,hat erfolgreich die Prüfung SP5 absolviert. Zeit: -","00:00:00.740",1,1]
[73," Ramona","Wagner",73,"Keine Zeit","———","00:00:29.690","00:00:01.310","-","Fahrer"," ","mit der StartNr. ",",hat erfolgreich die Prüfung SP5 absolviert. Zeit:","Fahrer Ramona Wagner mit der StartNr. 73 ,hat erfolgreich die Prüfung SP5 absolviert. Zeit:","Fahrer Ramona Wagner mit der StartNr. 73 ,hat erfolgreich die Prüfung SP5 absolviert. Zeit: -","00:00:01.310",1,1]
[74," Lars","Fahrenbach",74,"Keine Zeit","———","00:00:31.530","00:00:00.530","","Fahrer"," ","mit der StartNr. ",",hat erfolgreich die Prüfung SP5 absolviert. Zeit:","Fahrer Lars Fahrenbach mit der StartNr. 74 ,hat erfolgreich die Prüfung SP5 absolviert. Zeit:","Fahrer Lars Fahrenbach mit der StartNr. 74 ,hat erfolgreich die Prüfung SP5 absolviert. Zeit: ","00:00:00.530",1,1]
[75," Frank","Hoefnagels",75,"Keine Zeit","———","00:00:33.070","00:00:02.070","","Fahrer"," ","mit der StartNr. ",",hat erfolgreich die Prüfung SP5 absolviert. Zeit:","Fahrer Frank Hoefnagels mit der StartNr. 75 ,hat erfolgreich die Prüfung SP5 absolviert. Zeit:","Fahrer Frank Hoefnagels mit der StartNr. 75 ,hat erfolgreich die Prüfung SP5 absolviert. Zeit: ","00:00:02.070",1,1]
[76," Michael","Karch",76,"Keine Zeit","———","00:00:30.290","00:00:00.710","-","Fahrer"," ","mit der StartNr. ",",hat erfolgreich die Prüfung SP5 absolviert. Zeit:","Fahrer Michael Karch mit der StartNr. 76 ,hat erfolgreich die Prüfung SP5 absolviert. Zeit:","Fahrer Michael Karch mit der StartNr. 76 ,hat erfolgreich die Prüfung SP5 absolviert. Zeit: -","00:00:00.710",1,1]
[77," Dirk","Götze",77,"Keine Zeit","———","00:00:31.360","00:00:00.360","","Fahrer"," ","mit der StartNr. ",",hat erfolgreich die Prüfung SP5 absolviert. Zeit:","Fahrer Dirk Götze mit der StartNr. 77 ,hat erfolgreich die Prüfung SP5 absolviert. Zeit:","Fahrer Dirk Götze mit der StartNr. 77 ,hat erfolgreich die Prüfung SP5 absolviert. Zeit: ","00:00:00.360",1,"x"]
[78," Stefan","Hillers",78,"Keine Zeit","———","00:00:33.750","00:00:02.750","","Fahrer"," ","mit der StartNr. ",",hat erfolgreich die Prüfung SP5 absolviert. Zeit:","Fahrer Stefan Hillers mit der StartNr. 78 ,hat erfolgreich die Prüfung SP5 absolviert. Zeit:","Fahrer Stefan Hillers mit der StartNr. 78 ,hat erfolgreich die Prüfung SP5 absolviert. Zeit: ","00:00:02.750",1,"x"]
[79," Christian","Rafflenbeul",79,"Keine Zeit","———","00:00:30.550","00:00:00.450","-","Fahrer"," ","mit der StartNr. ",",hat erfolgreich die Prüfung SP5 absolviert. Zeit:","Fahrer Christian Rafflenbeul mit der StartNr. 79 ,hat erfolgreich die Prüfung SP5 absolviert. Zeit:","Fahrer Christian Rafflenbeul mit der StartNr. 79 ,hat erfolgreich die Prüfung SP5 absolviert. Zeit: -","00:00:00.450",1,"x"]
[80," Gerhard","Reuschel",80,"Keine Zeit","———","00:00:37.470","00:00:06.470","","Fahrer"," ","mit der StartNr. ",",hat erfolgreich die Prüfung SP5 absolviert. Zeit:","Fahrer Gerhard Reuschel mit der StartNr. 80 ,hat erfolgreich die Prüfung SP5 absolviert. Zeit:","Fahrer Gerhard Reuschel mit der StartNr. 80 ,hat erfolgreich die Prüfung SP5 absolviert. Zeit: ","00:00:06.470",1,"x"]
[81," Karsten","Rachow",81,"Keine Zeit","———","00:00:33.170","00:00:02.170","","Fahrer"," ","mit der StartNr. ",",hat erfolgreich die Prüfung SP5 absolviert. Zeit:","Fahrer Karsten Rachow mit der StartNr. 81 ,hat erfolgreich die Prüfung SP5 absolviert. Zeit:","Fahrer Karsten Rachow mit der StartNr. 81 ,hat erfolgreich die Prüfung SP5 absolviert. Zeit: ","00:00:02.170",1,"x"]
[82," Jürgen","Ziller",82,"Keine Zeit","———",{"$f":"IF(E83=\"Keine Zeit\",\"\",E83)","v":""},{"$error":"#VALUE!"},"","Fahrer"," ","mit der StartNr. ",",hat erfolgreich die Prüfung SP5 absolviert. Zeit:","Fahrer Jürgen Ziller mit der StartNr. 82 ,hat erfolgreich die Prüfung SP5 absolviert. Zeit:","","",""]
[83," Alexander","Weil",83,"Keine Zeit","———","00:00:32.780","00:00:01.780","","Fahrer"," ","mit der StartNr. ",",hat erfolgreich die Prüfung SP5 absolviert. Zeit:","Fahrer Alexander Weil mit der StartNr. 83 ,hat erfolgreich die Prüfung SP5 absolviert. Zeit:","Fahrer Alexander Weil mit der StartNr. 83 ,hat erfolgreich die Prüfung SP5 absolviert. Zeit: ","00:00:01.780",1,"x"]
[84," Josef","Lindenberger",84,"Keine Zeit","———","00:00:32.250","00:00:01.250","","Fahrer"," ","mit der StartNr. ",",hat erfolgreich die Prüfung SP5 absolviert. Zeit:","Fahrer Josef Lindenberger mit der StartNr. 84 ,hat erfolgreich die Prüfung SP5 absolviert. Zeit:","Fahrer Josef Lindenberger mit der StartNr. 84 ,hat erfolgreich die Prüfung SP5 absolviert. Zeit: ","00:00:01.250",1,"x"]
[85," Rick","Durante",85,"Keine Zeit","———","00:00:31.210","00:00:00.210","","Fahrer"," ","mit der StartNr. ",",hat erfolgreich die Prüfung SP5 absolviert. Zeit:","Fahrer Rick Durante mit der StartNr. 85 ,hat erfolgreich die Prüfung SP5 absolviert. Zeit:","Fahrer Rick Durante mit der StartNr. 85 ,hat erfolgreich die Prüfung SP5 absolviert. Zeit: ","00:00:00.210",1,"x"]
[86," Almuth","Siemann",86,"Keine Zeit","———","00:00:29.290","00:00:01.710","-","Fahrer"," ","mit der StartNr. ",",hat erfolgreich die Prüfung SP5 absolviert. Zeit:","Fahrer Almuth Siemann mit der StartNr. 86 ,hat erfolgreich die Prüfung SP5 absolviert. Zeit:","Fahrer Almuth Siemann mit der StartNr. 86 ,hat erfolgreich die Prüfung SP5 absolviert. Zeit: -","00:00:01.710",1,"x"]
[87," Axel","Strigl",87,"Keine Zeit","———","00:00:39.270","00:00:08.270","","Fahrer"," ","mit der StartNr. ",",hat erfolgreich die Prüfung SP5 absolviert. Zeit:","Fahrer Axel Strigl mit der StartNr. 87 ,hat erfolgreich die Prüfung SP5 absolviert. Zeit:","Fahrer Axel Strigl mit der StartNr. 87 ,hat erfolgreich die Prüfung SP5 absolviert. Zeit: ","00:00:08.270",1,"x"]
[88," Philip","Sommer",88,"Keine Zeit","———","00:00:31.220","00:00:00.220","","Fahrer"," ","mit der StartNr. ",",hat erfolgreich die Prüfung SP5 absolviert. Zeit:","Fahrer Philip Sommer mit der StartNr. 88 ,hat erfolgreich die Prüfung SP5 absolviert. Zeit:","Fahrer Philip Sommer mit der StartNr. 88 ,hat erfolgreich die Prüfung SP5 absolviert. Zeit: ","00:00:00.220",1,"x"]
[89," Jörg","Diehl",89,"Keine Zeit","———","00:00:31.960","00:00:00.960","","Fahrer"," ","mit der StartNr. ",",hat erfolgreich die Prüfung SP5 absolviert. Zeit:","Fahrer Jörg Diehl mit der StartNr. 89 ,hat erfolgreich die Prüfung SP5 absolviert. Zeit:","Fahrer Jörg Diehl mit der StartNr. 89 ,hat erfolgreich die Prüfung SP5 absolviert. Zeit: ","00:00:00.960",1,"x"]
[90," Matthias","Herzig",90,"Keine Zeit","———","00:00:31.300","00:00:00.300","","Fahrer"," ","mit der StartNr. ",",hat erfolgreich die Prüfung SP5 absolviert. Zeit:","Fahrer Matthias Herzig mit der StartNr. 90 ,hat erfolgreich die Prüfung SP5 absolviert. Zeit:","Fahrer Matthias Herzig mit der StartNr. 90 ,hat erfolgreich die Prüfung SP5 absolviert. Zeit: ","00:00:00.300",1,"x"]
[91," Christoph","Pasternak",91,"Keine Zeit","———","00:00:30.940","00:00:00.060","-","Fahrer"," ","mit der StartNr. ",",hat erfolgreich die Prüfung SP5 absolviert. Zeit:","Fahrer Christoph Pasternak mit der StartNr. 91 ,hat erfolgreich die Prüfung SP5 absolviert. Zeit:","Fahrer Christoph Pasternak mit der StartNr. 91 ,hat erfolgreich die Prüfung SP5 absolviert. Zeit: -","00:00:00.060",1,"x"]
[92," Lothar","Schupet",92,"Keine Zeit","———","00:00:31.050","00:00:00.050","","Fahrer"," ","mit der StartNr. ",",hat erfolgreich die Prüfung SP5 absolviert. Zeit:","Fahrer Lothar Schupet mit der StartNr. 92 ,hat erfolgreich die Prüfung SP5 absolviert. Zeit:","Fahrer Lothar Schupet mit der StartNr. 92 ,hat erfolgreich die Prüfung SP5 absolviert. Zeit: ","00:00:00.050",1,"x"]
[93," Wolfgang","Schertler",93,"Keine Zeit","———","00:00:32.200","00:00:01.200","","Fahrer"," ","mit der StartNr. ",",hat erfolgreich die Prüfung SP5 absolviert. Zeit:","Fahrer Wolfgang Schertler mit der StartNr. 93 ,hat erfolgreich die Prüfung SP5 absolviert. Zeit:","Fahrer Wolfgang Schertler mit der StartNr. 93 ,hat erfolgreich die Prüfung SP5 absolviert. Zeit: ","00:00:01.200",1,"x"]
[94," Thomas","Katzensteiner",94,"Keine Zeit","———","00:00:30.320","00:00:00.680","-","Fahrer"," ","mit der StartNr. ",",hat erfolgreich die Prüfung SP5 absolviert. Zeit:","Fahrer Thomas Katzensteiner mit der StartNr. 94 ,hat erfolgreich die Prüfung SP5 absolviert. Zeit:","Fahrer Thomas Katzensteiner mit der StartNr. 94 ,hat erfolgreich die Prüfung SP5 absolviert. Zeit: -","00:00:00.680",1,"x"]
[95," Hagen","Hackenberg",95,"Keine Zeit","———","00:00:30.700","00:00:00.300","-","Fahrer"," ","mit der StartNr. ",",hat erfolgreich die Prüfung SP5 absolviert. Zeit:","Fahrer Hagen Hackenberg mit der StartNr. 95 ,hat erfolgreich die Prüfung SP5 absolviert. Zeit:","Fahrer Hagen Hackenberg mit der StartNr. 95 ,hat erfolgreich die Prüfung SP5 absolviert. Zeit: -","00:00:00.300",1,"x"]
[96," Oliver","Dietz",96,"Keine Zeit","———","00:00:30.110","00:00:00.890","-","Fahrer"," ","mit der StartNr. ",",hat erfolgreich die Prüfung SP5 absolviert. Zeit:","Fahrer Oliver Dietz mit der StartNr. 96 ,hat erfolgreich die Prüfung SP5 absolviert. Zeit:","Fahrer Oliver Dietz mit der StartNr. 96 ,hat erfolgreich die Prüfung SP5 absolviert. Zeit: -","00:00:00.890",1,"x"]
[97," Horst","Kempf",97,"Keine Zeit","———","00:00:29.290","00:00:01.710","-","Fahrer"," ","mit der StartNr. ",",hat erfolgreich die Prüfung SP5 absolviert. Zeit:","Fahrer Horst Kempf mit der StartNr. 97 ,hat erfolgreich die Prüfung SP5 absolviert. Zeit:","Fahrer Horst Kempf mit der StartNr. 97 ,hat erfolgreich die Prüfung SP5 absolviert. Zeit: -","00:00:01.710",1,"x"]
[98," Detlev","Pauer",98,"Keine Zeit","———","00:00:34.700","00:00:03.700","","Fahrer"," ","mit der StartNr. ",",hat erfolgreich die Prüfung SP5 absolviert. Zeit:","Fahrer Detlev Pauer mit der StartNr. 98 ,hat erfolgreich die Prüfung SP5 absolviert. Zeit:","Fahrer Detlev Pauer mit der StartNr. 98 ,hat erfolgreich die Prüfung SP5 absolviert. Zeit: ","00:00:03.700",1,"x"]
[99," Dirk","Velte",99,"Keine Zeit","———","00:00:30.290","00:00:00.710","-","Fahrer"," ","mit der StartNr. ",",hat erfolgreich die Prüfung SP5 absolviert. Zeit:","Fahrer Dirk Velte mit der StartNr. 99 ,hat erfolgreich die Prüfung SP5 absolviert. Zeit:","Fahrer Dirk Velte mit der StartNr. 99 ,hat erfolgreich die Prüfung SP5 absolviert. Zeit: -","00:00:00.710",1,"x"]
[100," Thorsten","Krack",100,"Keine Zeit","———","00:00:29.970","00:00:01.030","-","Fahrer"," ","mit der StartNr. ",",hat erfolgreich die Prüfung SP5 absolviert. Zeit:","Fahrer Thorsten Krack mit der StartNr. 100 ,hat erfolgreich die Prüfung SP5 absolviert. Zeit:","Fahrer Thorsten Krack mit der StartNr. 100 ,hat erfolgreich die Prüfung SP5 absolviert. Zeit: -","00:00:01.030",1,"x"]
[101," Christian","Wittek",101,"Keine Zeit","———","00:00:34.830","00:00:03.830","","Fahrer"," ","mit der StartNr. ",",hat erfolgreich die Prüfung SP5 absolviert. Zeit:","Fahrer Christian Wittek mit der StartNr. 101 ,hat erfolgreich die Prüfung SP5 absolviert. Zeit:","Fahrer Christian Wittek mit der StartNr. 101 ,hat erfolgreich die Prüfung SP5 absolviert. Zeit: ","00:00:03.830",1,"x"]
[102," Benjamin","Hix",102,"Keine Zeit","———","00:00:31.510","00:00:00.510","","Fahrer"," ","mit der StartNr. ",",hat erfolgreich die Prüfung SP5 absolviert. Zeit:","Fahrer Benjamin Hix mit der StartNr. 102 ,hat erfolgreich die Prüfung SP5 absolviert. Zeit:","Fahrer Benjamin Hix mit der StartNr. 102 ,hat erfolgreich die Prüfung SP5 absolviert. Zeit: ","00:00:00.510",1,"x"]
[null,null,null,null,null,null,null,null,null,null,null,null,null,null,null,null,{"$f":"SUM(Q2:Q103)","v":98}]

{"sheet":"SP6","index":5,"n_rows":105,"n_cols":22,"rows_kept":105,"cut":false,"hidden":false,"merged":[]}
[null,null,null,null,null,null,null,null,null,"00:02:25"]
[null,null,null,"#","Start","Ziel","Fahrtzeit","Abweichung","Start","Ziel","Fahrzeit","Zeit","Diff.",null,null,null,null,null,"bitte auf das Vorzeichen \"-\" achten!","m:ss,00"]
[1," Christian","Jäger",1,"12:45:00,00","———",null,"———",{"$f":"IF(E3=\"———\",\"\",E3)","v":"12:45:00,00"},"12:47:24.830",{"$f":"IF(G3=\"Keine Zeit\",\"\",G3)","v":"00:00:00"},{"$f":"IF(K3=\"\",\"\",J3-I3)","v":"00:02:24.830"},{"$f":"ABS(L3-$J$1)","v":"00:00:00.170"},{"$f":"IF(ISERROR(L3),\"\",IF(L3<=$J$1,\"-\",\"\"))","v":"-"},"Fahrer"," ","mit der StartNr. ",",hat erfolgreich die Prüfung SP6 absolviert. Zeit:",{"$f":"IF(ISERROR(M3),\"\",O3&B3&P3&C3&P3&Q3&A3&P3&R3&P3&N3)","v":"Fahrer Christian Jäger mit der StartNr. 1 ,hat erfolgreich die Prüfung SP6 absolviert. Zeit: -"},{"$f":"IF(ISERROR(M3),\"\",M3)","v":"00:00:00.170"},{"$f":"IF(T3=\"\",\"\",1)","v":1},1]
[2," Daniel","Rinck",2,"12:54:00,00","———",null,"———",{"$f":"IF(E4=\"———\",\"\",E4)","v":"12:54:00,00"},"12:56:25.740",{"$f":"IF(G4=\"Keine Zeit\",\"\",G4)","v":"00:00:00"},{"$f":"IF(K4=\"\",\"\",J4-I4)","v":"00:02:25.740"},"00:00:00.740",{"$f":"IF(ISERROR(L4),\"\",IF(L4<=$J$1,\"-\",\"\"))","v":""},"Fahrer"," ","mit der StartNr. ",",hat erfolgreich die Prüfung SP6 absolviert. Zeit:",{"$f":"IF(ISERROR(M4),\"\",O4&B4&P4&C4&P4&Q4&A4&P4&R4&P4&N4)","v":"Fahrer Daniel Rinck mit der StartNr. 2 ,hat erfolgreich die Prüfung SP6 absolviert. Zeit: "},{"$f":"IF(ISERROR(M4),\"\",M4)","v":"00:00:00.740"},1,1]
[3," Malte","Proff-Klein",3,"———","———",null,"———","12:42:00","12:44:25.770",{"$f":"IF(G5=\"Keine Zeit\",\"\",G5)","v":"00:00:00"},"00:02:25.770","00:00:00.770","","Fahrer"," ","mit der StartNr. ",",hat erfolgreich die Prüfung SP6 absolviert. Zeit:","Fahrer Malte Proff-Klein mit der StartNr. 3 ,hat erfolgreich die Prüfung SP6 absolviert. Zeit: ","00:00:00.770",1,1]
[4," Dietmar","Siemssen",4,"———","———",null,"———","12:43:00","12:45:24.680","00:00:00","00:02:24.680","00:00:00.320","-","Fahrer"," ","mit der StartNr. ",",hat erfolgreich die Prüfung SP6 absolviert. Zeit:","Fahrer Dietmar Siemssen mit der StartNr. 4 ,hat erfolgreich die Prüfung SP6 absolviert. Zeit: -","00:00:00.320",1,"x"]
[5," Franz-Michael","Hartmann",5,"12:47:00,00","———",null,"———",{"$f":"IF(E7=\"———\",\"\",E7)","v":"12:47:00,00"},"12:49:30.060","00:00:00","00:02:30.060","00:00:05.060","","Fahrer"," ","mit der StartNr. ",",hat erfolgreich die Prüfung SP6 absolviert. Zeit:","Fahrer Franz-Michael Hartmann mit der StartNr. 5 ,hat erfolgreich die Prüfung SP6 absolviert. Zeit: ","00:00:05.060",1,1]
[6," Christoph","Schroer",6,"———","———",null,"———","12:41:00","12:43:25.360","00:00:00","00:02:25.360","00:00:00.360","","Fahrer"," ","mit der StartNr. ",",hat erfolgreich die Prüfung SP6 absolviert. Zeit:","Fahrer Christoph Schroer mit der StartNr. 6 ,hat erfolgreich die Prüfung SP6 absolviert. Zeit: ","00:00:00.360",1,1]
[7," Jochen","Artzinger-Bolten",7,"12:52:00,00","———",null,"———","12:52:00,00","12:54:16.250","00:00:00","00:02:16.250","00:00:08.750","-","Fahrer"," ","mit der StartNr. ",",hat erfolgreich die Prüfung SP6 absolviert. Zeit:","Fahrer Jochen Artzinger-Bolten mit der StartNr. 7 ,hat erfolgreich die Prüfung SP6 absolviert. Zeit: -","00:00:08.750",1,1]
[8," Friedhelm","Eickhorn",8,"12:44:00,00","———",null,"———","12:44:00,00","12:46:26.440","00:00:00","00:02:26.440","00:00:01.440","","Fahrer"," ","mit der StartNr. ",",hat erfolgreich die Prüfung SP6 absolviert. Zeit:","Fahrer Friedhelm Eickhorn mit der StartNr. 8 ,hat erfolgreich die Prüfung SP6 absolviert. Zeit: ","00:00:01.440",1,1]
[9," Carsten","Reblin",9,"13:19:00,00","———",null,"———","13:19:00,00","13:21:25.940","00:00:00","00:02:25.940","00:00:00.940","","Fahrer"," ","mit der StartNr. ",",hat erfolgreich die Prüfung SP6 absolviert. Zeit:","Fahrer Carsten Reblin mit der StartNr. 9 ,hat erfolgreich die Prüfung SP6 absolviert. Zeit: ","00:00:00.940",1,1]
[10," Dieter","Dinges",10,"13:34:00,00","———",null,"———","13:34:00,00","13:36:28.250","00:00:00","00:02:28.250","00:00:03.250","","Fahrer"," ","mit der StartNr. ",",hat erfolgreich die Prüfung SP6 absolviert. Zeit:","Fahrer Dieter Dinges mit der StartNr. 10 ,hat erfolgreich die Prüfung SP6 absolviert. Zeit: ","00:00:03.250",1,1]
[11," Wolfgang","Reeh",11,"12:48:00,00","———",null,"———","12:48:00,00","12:50:26.120","00:00:00","00:02:26.120","00:00:01.120","","Fahrer"," ","mit der StartNr. ",",hat erfolgreich die Prüfung SP6 absolviert. Zeit:","Fahrer Wolfgang Reeh mit der StartNr. 11 ,hat erfolgreich die Prüfung SP6 absolviert. Zeit: ","00:00:01.120",1,1]
[12," Andreas","Petry",12,"12:46:00,00","———",null,"———","12:46:00,00","12:48:25.380","00:00:00","00:02:25.380","00:00:00.380","","Fahrer"," ","mit der StartNr. ",",hat erfolgreich die Prüfung SP6 absolviert. Zeit:","Fahrer Andreas Petry mit der StartNr. 12 ,hat erfolgreich die Prüfung SP6 absolviert. Zeit: ","00:00:00.380",1,1]
[13," Ted","Prenzel",13,"12:49:00,00","———",null,"———","12:49:00,00","12:51:27.540","00:00:00","00:02:27.540","00:00:02.540","","Fahrer"," ","mit der StartNr. ",",hat erfolgreich die Prüfung SP6 absolviert. Zeit:","Fahrer Ted Prenzel mit der StartNr. 13 ,hat erfolgreich die Prüfung SP6 absolviert. Zeit: ","00:00:02.540",1,1]
[14," Micha","Barsties",14,"12:50:00,00","———",null,"———","12:50:00,00","12:52:15.230","00:00:00","00:02:15.230","00:00:09.770","-","Fahrer"," ","mit der StartNr. ",",hat erfolgreich die Prüfung SP6 absolviert. Zeit:","Fahrer Micha Barsties mit der StartNr. 14 ,hat erfolgreich die Prüfung SP6 absolviert. Zeit: -","00:00:09.770",1,1]
[15," Klaus","Flettner",15,"12:53:00,00","———",null,"———","12:53:00,00","12:55:25.970","00:00:00","00:02:25.970","00:00:00.970","","Fahrer"," ","mit der StartNr. ",",hat erfolgreich die Prüfung SP6 absolviert. Zeit:","Fahrer Klaus Flettner mit der StartNr. 15 ,hat erfolgreich die Prüfung SP6 absolviert. Zeit: ","00:00:00.970",1,1]
[16," Heinz","Frey",16,"12:51:00,00","———",null,"———","12:51:00,00","12:53:25.230","00:00:00","00:02:25.230","00:00:00.230","","Fahrer"," ","mit der StartNr. ",",hat erfolgreich die Prüfung SP6 absolviert. Zeit:","Fahrer Heinz Frey mit der StartNr. 16 ,hat erfolgreich die Prüfung SP6 absolviert. Zeit: ","00:00:00.230",1,1]
[17," Henning","Reichel",17,"13:41:00,00","———",null,"———","13:41:00,00","13:43:25.470","00:00:00","00:02:25.470","00:00:00.470","","Fahrer"," ","mit der StartNr. ",",hat erfolgreich die Prüfung SP6 absolviert. Zeit:","Fahrer Henning Reichel mit der StartNr. 17 ,hat erfolgreich die Prüfung SP6 absolviert. Zeit: ","00:00:00.470",1,1]
[18," Maik","Käbisch",18,"13:05:00,00","———",null,"———","13:05:00,00","13:07:27.810","00:00:00","00:02:27.810","00:00:02.810","","Fahrer"," ","mit der StartNr. ",",hat erfolgreich die Prüfung SP6 absolviert. Zeit:","Fahrer Maik Käbisch mit der StartNr. 18 ,hat erfolgreich die Prüfung SP6 absolviert. Zeit: ","00:00:02.810",1,1]
[19," Harald","Zapp",19,"———","———",null,"———","12:40:00","12:42:25.790","00:00:00","00:02:25.790","00:00:00.790","","Fahrer"," ","mit der StartNr. ",",hat erfolgreich die Prüfung SP6 absolviert. Zeit:","Fahrer Harald Zapp mit der StartNr. 19 ,hat erfolgreich die Prüfung SP6 absolviert. Zeit: ","00:00:00.790",1,1]
[20," Reinhard","Grzesik",20,"13:08:00,00","———",null,"———","13:08:00,00","13:10:25.020","00:00:00","00:02:25.020","00:00:00.020","","Fahrer"," ","mit der StartNr. ",",hat erfolgreich die Prüfung SP6 absolviert. Zeit:","Fahrer Reinhard Grzesik mit der StartNr. 20 ,hat erfolgreich die Prüfung SP6 absolviert. Zeit: ","00:00:00.020",1,1]
[21," Jörg","Sihler",21,"13:00:00,00","———",null,"———","13:00:00,00","13:02:26.400","00:00:00","00:02:26.400","00:00:01.400","","Fahrer"," ","mit der StartNr. ",",hat erfolgreich die Prüfung SP6 absolviert. Zeit:","Fahrer Jörg Sihler mit der StartNr. 21 ,hat erfolgreich die Prüfung SP6 absolviert. Zeit: ","00:00:01.400",1,1]
[22," Ingo","Winterstein",22,"13:06:00,00","———",null,"———","13:06:00,00","13:08:26.030","00:00:00","00:02:26.030","00:00:01.030","","Fahrer"," ","mit der StartNr. ",",hat erfolgreich die Prüfung SP6 absolviert. Zeit:","Fahrer Ingo Winterstein mit der StartNr. 22 ,hat erfolgreich die Prüfung SP6 absolviert. Zeit: ","00:00:01.030",1,1]
[23," Hans Werner","Melchior",23,"12:59:00,00","———",null,"———","12:59:00,00","13:01:27.190","00:00:00","00:02:27.190","00:00:02.190","","Fahrer"," ","mit der StartNr. ",",hat erfolgreich die Prüfung SP6 absolviert. Zeit:","Fahrer Hans Werner Melchior mit der StartNr. 23 ,hat erfolgreich die Prüfung SP6 absolviert. Zeit: ","00:00:02.190",1,1]
[24," Marco","Oriolo",24,"12:57:00,00","———",null,"———","12:57:00,00","12:59:24.020","00:00:00","00:02:24.020","00:00:00.980","-","Fahrer"," ","mit der StartNr. ",",hat erfolgreich die Prüfung SP6 absolviert. Zeit:","Fahrer Marco Oriolo mit der StartNr. 24 ,hat erfolgreich die Prüfung SP6 absolviert. Zeit: -","00:00:00.980",1,1]
[25," Manfred","Stommel",25,"13:01:00,00","———",null,"———","13:01:00,00","13:03:26.710","00:00:00","00:02:26.710","00:00:01.710","","Fahrer"," ","mit der StartNr. ",",hat erfolgreich die Prüfung SP6 absolviert. Zeit:","Fahrer Manfred Stommel mit der StartNr. 25 ,hat erfolgreich die Prüfung SP6 absolviert. Zeit: ","00:00:01.710",1,1]
[26," Carolin","Heusel",26,"12:56:00,00","———",null,"———","12:56:00,00","12:58:25.630","00:00:00","00:02:25.630","00:00:00.630","","Fahrer"," ","mit der StartNr. ",",hat erfolgreich die Prüfung SP6 absolviert. Zeit:","Fahrer Carolin Heusel mit der StartNr. 26 ,hat erfolgreich die Prüfung SP6 absolviert. Zeit: ","00:00:00.630",1,1]
[27," Regina","Philippi",27,"13:07:00,00","———",null,"———","13:07:00,00","13:09:26.080","00:00:00","00:02:26.080","00:00:01.080","","Fahrer"," ","mit der StartNr. ",",hat erfolgreich die Prüfung SP6 absolviert. Zeit:","Fahrer Regina Philippi mit der StartNr. 27 ,hat erfolgreich die Prüfung SP6 absolviert. Zeit: ","00:00:01.080",1,1]
[28," Christof","Aha",28,"13:38:00,00","———",null,"———","13:38:00,00","13:40:26.350","00:00:00","00:02:26.350","00:00:01.350","","Fahrer"," ","mit der StartNr. ",",hat erfolgreich die Prüfung SP6 absolviert. Zeit:","Fahrer Christof Aha mit der StartNr. 28 ,hat erfolgreich die Prüfung SP6 absolviert. Zeit: ","00:00:01.350",1,1]
[29," Dennis","Weiss",29,"13:10:00,00","———",null,"———","13:10:00,00","13:11:33.620","00:00:00","00:01:33.620","00:00:51.380","-","Fahrer"," ","mit der StartNr. ",",hat erfolgreich die Prüfung SP6 absolviert. Zeit:","Fahrer Dennis Weiss mit der StartNr. 29 ,hat erfolgreich die Prüfung SP6 absolviert. Zeit: -","00:00:51.380",1,1]
[30," Harald","Hamprecht",30,"13:09:00,00","———",null,"———","13:09:00,00","13:11:25.250","00:00:00","00:02:25.250","00:00:00.250","","Fahrer"," ","mit der StartNr. ",",hat erfolgreich die Prüfung SP6 absolviert. Zeit:","Fahrer Harald Hamprecht mit der StartNr. 30 ,hat erfolgreich die Prüfung SP6 absolviert. Zeit: ","00:00:00.250",1,1]
[31," Reno","Fiolic",31,"13:23:00,00","———",null,"———","13:23:00,00","13:24:51.070","00:00:00","00:01:51.070","00:00:33.930","-","Fahrer"," ","mit der StartNr. ",",hat erfolgreich die Prüfung SP6 absolviert. Zeit:","Fahrer Reno Fiolic mit der StartNr. 31 ,hat erfolgreich die Prüfung SP6 absolviert. Zeit: -","00:00:33.930",1,1]
[32," Jürgen","Kulpe",32,"13:04:00,00","———",null,"———","13:04:00,00","13:06:25.480","00:00:00","00:02:25.480","00:00:00.480","","Fahrer"," ","mit der StartNr. ",",hat erfolgreich die Prüfung SP6 absolviert. Zeit:","Fahrer Jürgen Kulpe mit der StartNr. 32 ,hat erfolgreich die Prüfung SP6 absolviert. Zeit: ","00:00:00.480",1,1]
[33," Konstantin","Kovarbasic",33,"12:58:00,00","———",null,"———","12:58:00,00","13:00:25.440","00:00:00","00:02:25.440","00:00:00.440","","Fahrer"," ","mit der StartNr. ",",hat erfolgreich die Prüfung SP6 absolviert. Zeit:","Fahrer Konstantin Kovarbasic mit der StartNr. 33 ,hat erfolgreich die Prüfung SP6 absolviert. Zeit: ","00:00:00.440",1,1]
[34," Nikolaus","Kratz",34,"13:20:00,00","———",null,"———","13:20:00,00","13:22:25.850","00:00:00","00:02:25.850","00:00:00.850","","Fahrer"," ","mit der StartNr. ",",hat erfolgreich die Prüfung SP6 absolviert. Zeit:","Fahrer Nikolaus Kratz mit der StartNr. 34 ,hat erfolgreich die Prüfung SP6 absolviert. Zeit: ","00:00:00.850",1,1]
[35," Andreas","Eberhardt",35,"13:31:00,00","———",null,"———","13:31:00,00","13:33:25.720","00:00:00","00:02:25.720","00:00:00.720","","Fahrer"," ","mit der StartNr. ",",hat erfolgreich die Prüfung SP6 absolviert. Zeit:","Fahrer Andreas Eberhardt mit der StartNr. 35 ,hat erfolgreich die Prüfung SP6 absolviert. Zeit: ","00:00:00.720",1,1]
[36," Gerhard","Thomas",36,"12:02:00,00","———",null,"———","13:02:00","13:04:28.090","00:00:00","00:02:28.090","00:00:03.090","","Fahrer"," ","mit der StartNr. ",",hat erfolgreich die Prüfung SP6 absolviert. Zeit:","Fahrer Gerhard Thomas mit der StartNr. 36 ,hat erfolgreich die Prüfung SP6 absolviert. Zeit: ","00:00:03.090",1,1]
[37," Lotzi","Kende",37,"13:29:00,00","———",null,"———","13:29:00,00","13:31:25.220","00:00:00","00:02:25.220","00:00:00.220","","Fahrer"," ","mit der StartNr. ",",hat erfolgreich die Prüfung SP6 absolviert. Zeit:","Fahrer Lotzi Kende mit der StartNr. 37 ,hat erfolgreich die Prüfung SP6 absolviert. Zeit: ","00:00:00.220",1,1]
[38," Jockel","Winkelhock",38,"13:13:00,00","———",null,"———","13:13:00,00","13:15:25.710","00:00:00","00:02:25.710","00:00:00.710","","Fahrer"," ","mit der StartNr. ",",hat erfolgreich die Prüfung SP6 absolviert. Zeit:","Fahrer Jockel Winkelhock mit der StartNr. 38 ,hat erfolgreich die Prüfung SP6 absolviert. Zeit: ","00:00:00.710",1,1]
[39," Sascha","Wilkesmann",39,"13:03:00,00","———",null,"———","13:03:00,00","13:05:25.170","00:00:00","00:02:25.170","00:00:00.170","","Fahrer"," ","mit der StartNr. ",",hat erfolgreich die Prüfung SP6 absolviert. Zeit:","Fahrer Sascha Wilkesmann mit der StartNr. 39 ,hat erfolgreich die Prüfung SP6 absolviert. Zeit: ","00:00:00.170",1,1]
[40," Gregor","Schulz",40,"14:04:00,00","———",null,"———","14:04:00,00","14:07:30.810","00:00:00","00:03:30.810","00:01:05.810","","Fahrer"," ","mit der StartNr. ",",hat erfolgreich die Prüfung SP6 absolviert. Zeit:","Fahrer Gregor Schulz mit der StartNr. 40 ,hat erfolgreich die Prüfung SP6 absolviert. Zeit: ","00:01:05.810",1,"x"]
[41," Peer","Hildmann",41,"13:32:00,00","———",null,"———","13:32:00,00","13:34:22.260","00:00:00","00:02:22.260","00:00:02.740","-","Fahrer"," ","mit der StartNr. ",",hat erfolgreich die Prüfung SP6 absolviert. Zeit:","Fahrer Peer Hildmann mit der StartNr. 41 ,hat erfolgreich die Prüfung SP6 absolviert. Zeit: -","00:00:02.740",1,1]
[42," Mina","Tander",42,"13:43:00,00","———",null,"———","13:43:00,00","13:45:27.400","00:00:00","00:02:27.400","00:00:02.400","","Fahrer"," ","mit der StartNr. ",",hat erfolgreich die Prüfung SP6 absolviert. Zeit:","Fahrer Mina Tander mit der StartNr. 42 ,hat erfolgreich die Prüfung SP6 absolviert. Zeit: ","00:00:02.400",1,1]
[43," Stefan","Iskan",43,"———","———","Keine Zeit","———","","","","",{"$error":"#VALUE!"},"","Fahrer"," ","mit der StartNr. ",",hat erfolgreich die Prüfung SP6 absolviert. Zeit:","","",""]
[44," Jean-Philippe","Kempf",44,"13:12:00,00","———",null,"———","13:12:00,00","13:13:47.720","00:00:00","00:01:47.720","00:00:37.280","-","Fahrer"," ","mit der StartNr. ",",hat erfolgreich die Prüfung SP6 absolviert. Zeit:","Fahrer Jean-Philippe Kempf mit der StartNr. 44 ,hat erfolgreich die Prüfung SP6 absolviert. Zeit: -","00:00:37.280",1,1]
[45," Daniel","Martin",45,"13:15:00,00","———",null,"———","13:15:00,00","13:17:26.130","00:00:00","00:02:26.130","00:00:01.130","","Fahrer"," ","mit der StartNr. ",",hat erfolgreich die Prüfung SP6 absolviert. Zeit:","Fahrer Daniel Martin mit der StartNr. 45 ,hat erfolgreich die Prüfung SP6 absolviert. Zeit: ","00:00:01.130",1,1]
[46," Elena","Funk",46,"13:35:00,00","———",null,"———","13:35:00,00","13:37:25.230","00:00:00","00:02:25.230","00:00:00.230","","Fahrer"," ","mit der StartNr. ",",hat erfolgreich die Prüfung SP6 absolviert. Zeit:","Fahrer Elena Funk mit der StartNr. 46 ,hat erfolgreich die Prüfung SP6 absolviert. Zeit: ","00:00:00.230",1,1]
[47," Hans","Mutschall",47,"13:36:00,00","———",null,"———","13:36:00,00","13:38:24.470","00:00:00","00:02:24.470","00:00:00.530","-","Fahrer"," ","mit der StartNr. ",",hat erfolgreich die Prüfung SP6 absolviert. Zeit:","Fahrer Hans Mutschall mit der StartNr. 47 ,hat erfolgreich die Prüfung SP6 absolviert. Zeit: -","00:00:00.530",1,1]
[48," Kahled","Rahman",48,"13:11:00,00","———",null,"———","13:11:00,00","13:13:25.620","00:00:00","00:02:25.620","00:00:00.620","","Fahrer"," ","mit der StartNr. ",",hat erfolgreich die Prüfung SP6 absolviert. Zeit:","Fahrer Kahled Rahman mit der StartNr. 48 ,hat erfolgreich die Prüfung SP6 absolviert. Zeit: ","00:00:00.620",1,1]
[49," Jochen","Schwarz",49,"13:16:00,00","———",null,"———","13:16:00,00","13:18:25.220","00:00:00","00:02:25.220","00:00:00.220","","Fahrer"," ","mit der StartNr. ",",hat erfolgreich die Prüfung SP6 absolviert. Zeit:","Fahrer Jochen Schwarz mit der StartNr. 49 ,hat erfolgreich die Prüfung SP6 absolviert. Zeit: ","00:00:00.220",1,1]
[50," Axel","Nawrath",50,"13:49:00,00","———",null,"———","13:49:00,00","13:51:33.030","00:00:00","00:02:33.030","00:00:08.030","","Fahrer"," ","mit der StartNr. ",",hat erfolgreich die Prüfung SP6 absolviert. Zeit:","Fahrer Axel Nawrath mit der StartNr. 50 ,hat erfolgreich die Prüfung SP6 absolviert. Zeit: ","00:00:08.030",1,"x"]
[51," Birgit","Claussen",51,"13:44:00,00","———",null,"———","13:44:00,00","13:46:29.940","00:00:00","00:02:29.940","00:00:04.940","","Fahrer"," ","mit der StartNr. ",",hat erfolgreich die Prüfung SP6 absolviert. Zeit:","Fahrer Birgit Claussen mit der StartNr. 51 ,hat erfolgreich die Prüfung SP6 absolviert. Zeit: ","00:00:04.940",1,1]
[52," Harald","König",52,"13:17:00,00","———",null,"———","13:17:00,00","13:19:26.550","00:00:00","00:02:26.550","00:00:01.550","","Fahrer"," ","mit der StartNr. ",",hat erfolgreich die Prüfung SP6 absolviert. Zeit:","Fahrer Harald König mit der StartNr. 52 ,hat erfolgreich die Prüfung SP6 absolviert. Zeit: ","00:00:01.550",1,1]
[53," Thomas","Blank",53,"13:37:00,00","———",null,"———","13:37:00,00","13:39:22.550","00:00:00","00:02:22.550","00:00:02.450","-","Fahrer"," ","mit der StartNr. ",",hat erfolgreich die Prüfung SP6 absolviert. Zeit:","Fahrer Thomas Blank mit der StartNr. 53 ,hat erfolgreich die Prüfung SP6 absolviert. Zeit: -","00:00:02.450",1,1]
[54," Heidi","Eberhardt",54,"13:39:00,00","———",null,"———","13:39:00,00","13:41:24.890","00:00:00","00:02:24.890","00:00:00.110","-","Fahrer"," ","mit der StartNr. ",",hat erfolgreich die Prüfung SP6 absolviert. Zeit:","Fahrer Heidi Eberhardt mit der StartNr. 54 ,hat erfolgreich die Prüfung SP6 absolviert. Zeit: -","00:00:00.110",1,1]
[55," Karina","Ansos",55,"13:46:00,00","———",null,"———","13:46:00,00","13:48:25.340","00:00:00","00:02:25.340","00:00:00.340","","Fahrer"," ","mit der StartNr. ",",hat erfolgreich die Prüfung SP6 absolviert. Zeit:","Fahrer Karina Ansos mit der StartNr. 55 ,hat erfolgreich die Prüfung SP6 absolviert. Zeit: ","00:00:00.340",1,1]
[56," Michael","Gotta",56,"13:18:00,00","———",null,"———","13:18:00,00","13:20:27.400","00:00:00","00:02:27.400","00:00:02.400","","Fahrer"," ","mit der StartNr. ",",hat erfolgreich die Prüfung SP6 absolviert. Zeit:","Fahrer Michael Gotta mit der StartNr. 56 ,hat erfolgreich die Prüfung SP6 absolviert. Zeit: ","00:00:02.400",1,1]
[57," Stefanie","Rinck",57,"13:42:00,00","———",null,"———","13:42:00,00","13:44:24.480","00:00:00","00:02:24.480","00:00:00.520","-","Fahrer"," ","mit der StartNr. ",",hat erfolgreich die Prüfung SP6 absolviert. Zeit:","Fahrer Stefanie Rinck mit der StartNr. 57 ,hat erfolgreich die Prüfung SP6 absolviert. Zeit: -","00:00:00.520",1,1]
[58," Armin","Slotta",58,"13:45:00,00","———",null,"———","13:45:00,00","13:47:21.210","00:00:00","00:02:21.210","00:00:03.790","-","Fahrer"," ","mit der StartNr. ",",hat erfolgreich die Prüfung SP6 absolviert. Zeit:","Fahrer Armin Slotta mit der StartNr. 58 ,hat erfolgreich die Prüfung SP6 absolviert. Zeit: -","00:00:03.790",1,1]
[59," Julia","Kende",59,"13:30:00,00","———",null,"———","13:30:00,00","13:32:21.080","00:00:00","00:02:21.080","00:00:03.920","-","Fahrer"," ","mit der StartNr. ",",hat erfolgreich die Prüfung SP6 absolviert. Zeit:","Fahrer Julia Kende mit der StartNr. 59 ,hat erfolgreich die Prüfung SP6 absolviert. Zeit: -","00:00:03.920",1,1]
[60," Robert","Bleckmann",60,"13:21:00,00","———",null,"———","13:21:00,00","13:23:25.170","00:00:00","00:02:25.170","00:00:00.170","","Fahrer"," ","mit der StartNr. ",",hat erfolgreich die Prüfung SP6 absolviert. Zeit:","Fahrer Robert Bleckmann mit der StartNr. 60 ,hat erfolgreich die Prüfung SP6 absolviert. Zeit: ","00:00:00.170",1,1]
[61," Christof","Harwardt",61,"14:10:00,00","———",null,"———","14:10:00,00","14:12:25.920","00:00:00","00:02:25.920","00:00:00.920","","Fahrer"," ","mit der StartNr. ",",hat erfolgreich die Prüfung SP6 absolviert. Zeit:","Fahrer Christof Harwardt mit der StartNr. 61 ,hat erfolgreich die Prüfung SP6 absolviert. Zeit: ","00:00:00.920",1,1]
[62," Thomas","Kahns",62,"13:56:00,00","———",null,"———","13:56:00,00","13:58:29.850","00:00:00","00:02:29.850","00:00:04.850","","Fahrer"," ","mit der StartNr. ",",hat erfolgreich die Prüfung SP6 absolviert. Zeit:","Fahrer Thomas Kahns mit der StartNr. 62 ,hat erfolgreich die Prüfung SP6 absolviert. Zeit: ","00:00:04.850",1,1]
[63," Maximilian","Herbst",63,"13:14:00,00","———",null,"———","13:14:00,00","13:16:27.110","00:00:00","00:02:27.110","00:00:02.110","","Fahrer"," ","mit der StartNr. ",",hat erfolgreich die Prüfung SP6 absolviert. Zeit:","Fahrer Maximilian Herbst mit der StartNr. 63 ,hat erfolgreich die Prüfung SP6 absolviert. Zeit: ","00:00:02.110",1,1]
[64," Jürgen","Buchhold",64,"13:28:00,00","———",null,"———","13:28:00,00","13:30:24.820","00:00:00","00:02:24.820","00:00:00.180","-","Fahrer"," ","mit der StartNr. ",",hat erfolgreich die Prüfung SP6 absolviert. Zeit:","Fahrer Jürgen Buchhold mit der StartNr. 64 ,hat erfolgreich die Prüfung SP6 absolviert. Zeit: -","00:00:00.180",1,1]
[65," Oliver","Klink",65,"———","———","Keine Zeit","———","","","","",{"$f":"ABS(L67-$J$1)","v":{"$error":"#VALUE!"}},"","Fahrer"," ","mit der StartNr. ",",hat erfolgreich die Prüfung SP6 absolviert. Zeit:","","",{"$f":"IF(T67=\"\",\"\",1)","v":""}]
[66," Peter","Bel",66,"13:33:00,00","———",null,"———","13:33:00,00","13:35:01.160","00:00:00",{"$f":"IF(K68=\"\",\"\",J68-I68)","v":"00:02:01.160"},"00:00:23.840",{"$f":"IF(ISERROR(L68),\"\",IF(L68<=$J$1,\"-\",\"\"))","v":"-"},"Fahrer"," ","mit der StartNr. ",",hat erfolgreich die Prüfung SP6 absolviert. Zeit:",{"$f":"IF(ISERROR(M68),\"\",O68&B68&P68&C68&P68&Q68&A68&P68&R68&P68&N68)","v":"Fahrer Peter Bel mit der StartNr. 66 ,hat erfolgreich die Prüfung SP6 absolviert. Zeit: -"},{"$f":"IF(ISERROR(M68),\"\",M68)","v":"00:00:23.840"},1,1]
[67," Thomas","Mirau",67,"13:40:00,00","———",null,"———",{"$f":"IF(E69=\"———\",\"\",E69)","v":"13:40:00,00"},"13:42:26.460",{"$f":"IF(G69=\"Keine Zeit\",\"\",G69)","v":"00:00:00"},"00:02:26.460","00:00:01.460","","Fahrer"," ","mit der StartNr. ",",hat erfolgreich die Prüfung SP6 absolviert. Zeit:","Fahrer Thomas Mirau mit der StartNr. 67 ,hat erfolgreich die Prüfung SP6 absolviert. Zeit: ","00:00:01.460",1,1]
[68," Markus","Gotta",68,"13:27:00,00","———",null,"———","13:27:00,00","13:29:26","00:00:00","00:02:26","00:00:01","","Fahrer"," ","mit der StartNr. ",",hat erfolgreich die Prüfung SP6 absolviert. Zeit:","Fahrer Markus Gotta mit der StartNr. 68 ,hat erfolgreich die Prüfung SP6 absolviert. Zeit: ","00:00:01",1,1]
[69," Robin","Keulertz",69,"13:24:00,00","———",null,"———","13:24:00,00","13:26:26.130","00:00:00","00:02:26.130","00:00:01.130","","Fahrer"," ","mit der StartNr. ",",hat erfolgreich die Prüfung SP6 absolviert. Zeit:","Fahrer Robin Keulertz mit der StartNr. 69 ,hat erfolgreich die Prüfung SP6 absolviert. Zeit: ","00:00:01.130",1,1]
[70," Christian","Häp",70,"13:51:00,00","———",null,"———","13:51:00,00","13:53:25.750","00:00:00","00:02:25.750","00:00:00.750","","Fahrer"," ","mit der StartNr. ",",hat erfolgreich die Prüfung SP6 absolviert. Zeit:","Fahrer Christian Häp mit der StartNr. 70 ,hat erfolgreich die Prüfung SP6 absolviert. Zeit: ","00:00:00.750",1,1]
[71," Ingolf","Zschockelt",71,"13:22:00,00","———",null,"———","13:22:00,00","13:24:25.540","00:00:00","00:02:25.540","00:00:00.540","","Fahrer"," ","mit der StartNr. ",",hat erfolgreich die Prüfung SP6 absolviert. Zeit:","Fahrer Ingolf Zschockelt mit der StartNr. 71 ,hat erfolgreich die Prüfung SP6 absolviert. Zeit: ","00:00:00.540",1,1]
[72," Michael","Barsties",72,"13:53:00,00","———",null,"———","13:53:00,00","13:55:25.790","00:00:00","00:02:25.790","00:00:00.790","","Fahrer"," ","mit der StartNr. ",",hat erfolgreich die Prüfung SP6 absolviert. Zeit:","Fahrer Michael Barsties mit der StartNr. 72 ,hat erfolgreich die Prüfung SP6 absolviert. Zeit: ","00:00:00.790",1,1]
[73," Ramona","Wagner",73,"13:52:00,00","———",null,"———","13:52:00,00","13:53:55.570","00:00:00","00:01:55.570","00:00:29.430","-","Fahrer"," ","mit der StartNr. ",",hat erfolgreich die Prüfung SP6 absolviert. Zeit:","Fahrer Ramona Wagner mit der StartNr. 73 ,hat erfolgreich die Prüfung SP6 absolviert. Zeit: -","00:00:29.430",1,1]
[74," Lars","Fahrenbach",74,"13:59:00,00","———",null,"———","13:59:00,00","14:01:25.170","00:00:00","00:02:25.170","00:00:00.170","","Fahrer"," ","mit der StartNr. ",",hat erfolgreich die Prüfung SP6 absolviert. Zeit:","Fahrer Lars Fahrenbach mit der StartNr. 74 ,hat erfolgreich die Prüfung SP6 absolviert. Zeit: ","00:00:00.170",1,1]
[75," Frank","Hoefnagels",75,"13:50:00,00","———",null,"———","13:50:00,00","13:52:25.140","00:00:00","00:02:25.140","00:00:00.140","","Fahrer"," ","mit der StartNr. ",",hat erfolgreich die Prüfung SP6 absolviert. Zeit:","Fahrer Frank Hoefnagels mit der StartNr. 75 ,hat erfolgreich die Prüfung SP6 absolviert. Zeit: ","00:00:00.140",1,1]
[76," Michael","Karch",76,"13:47:00,00","———",null,"———","13:47:00,00","13:49:24.530","00:00:00","00:02:24.530","00:00:00.470","-","Fahrer"," ","mit der StartNr. ",",hat erfolgreich die Prüfung SP6 absolviert. Zeit:","Fahrer Michael Karch mit der StartNr. 76 ,hat erfolgreich die Prüfung SP6 absolviert. Zeit: -","00:00:00.470",1,1]
[77," Dirk","Götze",77,"13:25:00,00","———",null,"———","13:25:00,00","13:27:19.660","00:00:00","00:02:19.660","00:00:05.340","-","Fahrer"," ","mit der StartNr. ",",hat erfolgreich die Prüfung SP6 absolviert. Zeit:","Fahrer Dirk Götze mit der StartNr. 77 ,hat erfolgreich die Prüfung SP6 absolviert. Zeit: -","00:00:05.340",1,1]
[78," Stefan","Hillers",78,"13:26:00,00","———",null,"———","13:26:00,00","13:27:36.760","00:00:00","00:01:36.760","00:00:48.240","-","Fahrer"," ","mit der StartNr. ",",hat erfolgreich die Prüfung SP6 absolviert. Zeit:","Fahrer Stefan Hillers mit der StartNr. 78 ,hat erfolgreich die Prüfung SP6 absolviert. Zeit: -","00:00:48.240",1,1]
[79," Christian","Rafflenbeul",79,"14:14:00,00","———",null,"———","14:14:00,00","14:16:25.020","00:00:00","00:02:25.020","00:00:00.020","","Fahrer"," ","mit der StartNr. ",",hat erfolgreich die Prüfung SP6 absolviert. Zeit:","Fahrer Christian Rafflenbeul mit der StartNr. 79 ,hat erfolgreich die Prüfung SP6 absolviert. Zeit: ","00:00:00.020",1,1]
[80," Gerhard","Reuschel",80,"14:15:00,00","———",null,"———","14:15:00,00","14:16:39.900","00:00:00","00:01:39.900","00:00:45.100","-","Fahrer"," ","mit der StartNr. ",",hat erfolgreich die Prüfung SP6 absolviert. Zeit:","Fahrer Gerhard Reuschel mit der StartNr. 80 ,hat erfolgreich die Prüfung SP6 absolviert. Zeit: -","00:00:45.100",1,1]
[81," Karsten","Rachow",81,"13:48:00,00","———",null,"———","13:48:00,00","13:50:25.910","00:00:00","00:02:25.910","00:00:00.910","","Fahrer"," ","mit der StartNr. ",",hat erfolgreich die Prüfung SP6 absolviert. Zeit:","Fahrer Karsten Rachow mit der StartNr. 81 ,hat erfolgreich die Prüfung SP6 absolviert. Zeit: ","00:00:00.910",1,1]
[82," Jürgen","Ziller",82,"———","———","Keine Zeit","———","","","","",{"$error":"#VALUE!"},"","Fahrer"," ","mit der StartNr. ",",hat erfolgreich die Prüfung SP6 absolviert. Zeit:","","",""]
[83," Alexander","Weil",83,"13:55:00,00","———",null,"———","13:55:00,00","13:57:27.430","00:00:00","00:02:27.430","00:00:02.430","","Fahrer"," ","mit der StartNr. ",",hat erfolgreich die Prüfung SP6 absolviert. Zeit:","Fahrer Alexander Weil mit der StartNr. 83 ,hat erfolgreich die Prüfung SP6 absolviert. Zeit: ","00:00:02.430",1,1]
[84," Josef","Lindenberger",84,"14:18:00,00","———",null,"———","14:18:00,00","14:20:27.180","00:00:00","00:02:27.180","00:00:02.180","","Fahrer"," ","mit der StartNr. ",",hat erfolgreich die Prüfung SP6 absolviert. Zeit:","Fahrer Josef Lindenberger mit der StartNr. 84 ,hat erfolgreich die Prüfung SP6 absolviert. Zeit: ","00:00:02.180",1,1]
[85," Rick","Durante",85,"14:12:00,00","———",null,"———","14:12:00,00","14:13:42.550","00:00:00","00:01:42.550","00:00:42.450","-","Fahrer"," ","mit der StartNr. ",",hat erfolgreich die Prüfung SP6 absolviert. Zeit:","Fahrer Rick Durante mit der StartNr. 85 ,hat erfolgreich die Prüfung SP6 absolviert. Zeit: -","00:00:42.450",1,1]
[86," Almuth","Siemann",86,"14:11:00,00","———",null,"———","14:11:00,00","14:13:25.100","00:00:00","00:02:25.100","00:00:00.100","","Fahrer"," ","mit der StartNr. ",",hat erfolgreich die Prüfung SP6 absolviert. Zeit:","Fahrer Almuth Siemann mit der StartNr. 86 ,hat erfolgreich die Prüfung SP6 absolviert. Zeit: ","00:00:00.100",1,1]
[87," Axel","Strigl",87,"13:54:00,00","———",null,"———","13:54:00,00","13:56:45.740","00:00:00","00:02:45.740","00:00:20.740","","Fahrer"," ","mit der StartNr. ",",hat erfolgreich die Prüfung SP6 absolviert. Zeit:","Fahrer Axel Strigl mit der StartNr. 87 ,hat erfolgreich die Prüfung SP6 absolviert. Zeit: ","00:00:20.740",1,1]
[88," Philip","Sommer",88,"12:55:00,00","———",null,"———","12:55:00,00","12:57:25.380","00:00:00","00:02:25.380","00:00:00.380","","Fahrer"," ","mit der StartNr. ",",hat erfolgreich die Prüfung SP6 absolviert. Zeit:","Fahrer Philip Sommer mit der StartNr. 88 ,hat erfolgreich die Prüfung SP6 absolviert. Zeit: ","00:00:00.380",1,1]
[89," Jörg","Diehl",89,"14:16:00,00","———",null,"———","14:16:00,00","14:18:24.290","00:00:00","00:02:24.290","00:00:00.710","-","Fahrer"," ","mit der StartNr. ",",hat erfolgreich die Prüfung SP6 absolviert. Zeit:","Fahrer Jörg Diehl mit der StartNr. 89 ,hat erfolgreich die Prüfung SP6 absolviert. Zeit: -","00:00:00.710",1,1]
[90," Matthias","Herzig",90,"14:09:00,00","———",null,"———","14:09:00,00","14:11:22.180","00:00:00","00:02:22.180","00:00:02.820","-","Fahrer"," ","mit der StartNr. ",",hat erfolgreich die Prüfung SP6 absolviert. Zeit:","Fahrer Matthias Herzig mit der StartNr. 90 ,hat erfolgreich die Prüfung SP6 absolviert. Zeit: -","00:00:02.820",1,1]
[91," Christoph","Pasternak",91,"13:57:00,00","———",null,"———","13:57:00,00","13:59:23","00:00:00","00:02:23","00:00:02","-","Fahrer"," ","mit der StartNr. ",",hat erfolgreich die Prüfung SP6 absolviert. Zeit:","Fahrer Christoph Pasternak mit der StartNr. 91 ,hat erfolgreich die Prüfung SP6 absolviert. Zeit: -","00:00:02",1,1]
[92," Lothar","Schupet",92,"14:08:00,00","———",null,"———","14:08:00,00","14:10:25.570","00:00:00","00:02:25.570","00:00:00.570","","Fahrer"," ","mit der StartNr. ",",hat erfolgreich die Prüfung SP6 absolviert. Zeit:","Fahrer Lothar Schupet mit der StartNr. 92 ,hat erfolgreich die Prüfung SP6 absolviert. Zeit: ","00:00:00.570",1,1]
[93," Wolfgang","Schertler",93,"13:58:00,00","———",null,"———","13:58:00,00","14:00:30.240","00:00:00","00:02:30.240","00:00:05.240","","Fahrer"," ","mit der StartNr. ",",hat erfolgreich die Prüfung SP6 absolviert. Zeit:","Fahrer Wolfgang Schertler mit der StartNr. 93 ,hat erfolgreich die Prüfung SP6 absolviert. Zeit: ","00:00:05.240",1,1]
[94," Thomas","Katzensteiner",94,"14:07:00,00","———",null,"———","14:07:00,00","14:09:25.800","00:00:00","00:02:25.800","00:00:00.800","","Fahrer"," ","mit der StartNr. ",",hat erfolgreich die Prüfung SP6 absolviert. Zeit:","Fahrer Thomas Katzensteiner mit der StartNr. 94 ,hat erfolgreich die Prüfung SP6 absolviert. Zeit: ","00:00:00.800",1,1]
[95," Hagen","Hackenberg",95,"14:00:00,00","———",null,"———","14:00:00,00","14:02:25.990","00:00:00","00:02:25.990","00:00:00.990","","Fahrer"," ","mit der StartNr. ",",hat erfolgreich die Prüfung SP6 absolviert. Zeit:","Fahrer Hagen Hackenberg mit der StartNr. 95 ,hat erfolgreich die Prüfung SP6 absolviert. Zeit: ","00:00:00.990",1,1]
[96," Oliver","Dietz",96,"14:17:00,00","———",null,"———","14:17:00,00","14:19:28.060","00:00:00","00:02:28.060","00:00:03.060","","Fahrer"," ","mit der StartNr. ",",hat erfolgreich die Prüfung SP6 absolviert. Zeit:","Fahrer Oliver Dietz mit der StartNr. 96 ,hat erfolgreich die Prüfung SP6 absolviert. Zeit: ","00:00:03.060",1,1]
[97," Horst","Kempf",97,"14:03:00,00","———",null,"———","14:03:00,00","14:05:29.750","00:00:00","00:02:29.750","00:00:04.750","","Fahrer"," ","mit der StartNr. ",",hat erfolgreich die Prüfung SP6 absolviert. Zeit:","Fahrer Horst Kempf mit der StartNr. 97 ,hat erfolgreich die Prüfung SP6 absolviert. Zeit: ","00:00:04.750",1,1]
[98," Detlev","Pauer",98,"14:02:00,00","———",null,"———","14:02:00,00","14:04:24.730","00:00:00","00:02:24.730","00:00:00.270","-","Fahrer"," ","mit der StartNr. ",",hat erfolgreich die Prüfung SP6 absolviert. Zeit:","Fahrer Detlev Pauer mit der StartNr. 98 ,hat erfolgreich die Prüfung SP6 absolviert. Zeit: -","00:00:00.270",1,1]
[99," Dirk","Velte",99,"14:01:00,00","———",null,"———","14:01:00,00","14:03:26.140","00:00:00","00:02:26.140","00:00:01.140","","Fahrer"," ","mit der StartNr. ",",hat erfolgreich die Prüfung SP6 absolviert. Zeit:","Fahrer Dirk Velte mit der StartNr. 99 ,hat erfolgreich die Prüfung SP6 absolviert. Zeit: ","00:00:01.140",1,1]
[100," Thorsten","Krack",100,"14:05:00,00","———",null,"———","14:05:00,00","14:07:33.180","00:00:00","00:02:33.180","00:00:08.180","","Fahrer"," ","mit der StartNr. ",",hat erfolgreich die Prüfung SP6 absolviert. Zeit:","Fahrer Thorsten Krack mit der StartNr. 100 ,hat erfolgreich die Prüfung SP6 absolviert. Zeit: ","00:00:08.180",1,1]
[101," Christian","Wittek",101,"14:06:00,00","———",null,"———","14:06:00,00","14:08:22.630","00:00:00","00:02:22.630","00:00:02.370","-","Fahrer"," ","mit der StartNr. ",",hat erfolgreich die Prüfung SP6 absolviert. Zeit:","Fahrer Christian Wittek mit der StartNr. 101 ,hat erfolgreich die Prüfung SP6 absolviert. Zeit: -","00:00:02.370",1,1]
[102," Benjamin","Hix",102,"14:13:00,00","———",null,"———","14:13:00,00","14:15:26.720","00:00:00","00:02:26.720","00:00:01.720","","Fahrer"," ","mit der StartNr. ",",hat erfolgreich die Prüfung SP6 absolviert. Zeit:","Fahrer Benjamin Hix mit der StartNr. 102 ,hat erfolgreich die Prüfung SP6 absolviert. Zeit: ","00:00:01.720",1,1]
[null,null,null,999,"———","———","Keine Zeit","———",null,null,null,null,null,null,null,null,null,null,null,null,{"$f":"SUM(U3:U104)","v":99}]

{"sheet":"SP7","index":6,"n_rows":0,"n_cols":0,"rows_kept":0,"cut":false,"hidden":false,"merged":[]}

{"sheet":"SP8_Sprint","index":7,"n_rows":104,"n_cols":16,"rows_kept":104,"cut":false,"hidden":false,"merged":[]}
[null,null,null,"#","Fahrtzeit","Abweichung","00:00:12","Diff.",null,null,null,null,null,"bitte auf das Vorzeichen \"-\" achten!","m:ss,00"]
[1," Christian","Jäger",1,"Keine Zeit","———",{"$f":"IF(E2=\"Keine Zeit\",\"\",E2)","v":""},{"$f":"ABS(G2-$G$1)","v":{"$error":"#VALUE!"}},{"$f":"IF(G2<=$G$1,\"-\",\"\")","v":""},"Fahrer"," ","mit der StartNr. ",",hat erfolgreich die Prüfung SP8 absolviert. Zeit:",{"$f":"IF(ISERROR(H2),\"\",J2&B2&K2&C2&K2&L2&A2&K2&M2&K2&I2)","v":""},{"$f":"IF(ISERROR(H2),\"\",H2)","v":""},{"$f":"IF(O2=\"\",\"\",1)","v":""}]
[2," Daniel","Rinck",2,"Keine Zeit","———",{"$f":"IF(E3=\"Keine Zeit\",\"\",E3)","v":""},{"$error":"#VALUE!"},{"$f":"IF(G3<=$G$1,\"-\",\"\")","v":""},"Fahrer"," ","mit der StartNr. ",",hat erfolgreich die Prüfung SP8 absolviert. Zeit:",{"$f":"IF(ISERROR(H3),\"\",J3&B3&K3&C3&K3&L3&A3&K3&M3)","v":""},{"$f":"IF(ISERROR(H3),\"\",H3)","v":""},{"$f":"IF(O3=\"\",\"\",1)","v":""}]
[3," Malte","Proff-Klein",3,"Keine Zeit","———","",{"$error":"#VALUE!"},"","Fahrer"," ","mit der StartNr. ",",hat erfolgreich die Prüfung SP8 absolviert. Zeit:","","",""]
[4," Dietmar","Siemssen",4,"Keine Zeit","———","",{"$error":"#VALUE!"},"","Fahrer"," ","mit der StartNr. ",",hat erfolgreich die Prüfung SP8 absolviert. Zeit:","","",""]
[5," Franz-Michael","Hartmann",5,"Keine Zeit","———","",{"$error":"#VALUE!"},"","Fahrer"," ","mit der StartNr. ",",hat erfolgreich die Prüfung SP8 absolviert. Zeit:","","",""]
[6," Christoph","Schroer",6,"Keine Zeit","———","",{"$error":"#VALUE!"},"","Fahrer"," ","mit der StartNr. ",",hat erfolgreich die Prüfung SP8 absolviert. Zeit:","","",""]
[7," Jochen","Artzinger-Bolten",7,"Keine Zeit","———","",{"$error":"#VALUE!"},"","Fahrer"," ","mit der StartNr. ",",hat erfolgreich die Prüfung SP8 absolviert. Zeit:","","",""]
[8," Friedhelm","Eickhorn",8,"Keine Zeit","———","",{"$error":"#VALUE!"},"","Fahrer"," ","mit der StartNr. ",",hat erfolgreich die Prüfung SP8 absolviert. Zeit:","","",""]
[9," Carsten","Reblin",9,"Keine Zeit","———","",{"$error":"#VALUE!"},"","Fahrer"," ","mit der StartNr. ",",hat erfolgreich die Prüfung SP8 absolviert. Zeit:","","",""]
[10," Dieter","Dinges",10,"Keine Zeit","———","",{"$error":"#VALUE!"},"","Fahrer"," ","mit der StartNr. ",",hat erfolgreich die Prüfung SP8 absolviert. Zeit:","","",""]
[11," Wolfgang","Reeh",11,"Keine Zeit","———","",{"$error":"#VALUE!"},"","Fahrer"," ","mit der StartNr. ",",hat erfolgreich die Prüfung SP8 absolviert. Zeit:","","",""]
[12," Andreas","Petry",12,"Keine Zeit","———","",{"$error":"#VALUE!"},"","Fahrer"," ","mit der StartNr. ",",hat erfolgreich die Prüfung SP8 absolviert. Zeit:","","",""]
[13," Ted","Prenzel",13,"Keine Zeit","———","",{"$error":"#VALUE!"},"","Fahrer"," ","mit der StartNr. ",",hat erfolgreich die Prüfung SP8 absolviert. Zeit:","","",""]
[14," Micha","Barsties",14,"Keine Zeit","———","",{"$error":"#VALUE!"},"","Fahrer"," ","mit der StartNr. ",",hat erfolgreich die Prüfung SP8 absolviert. Zeit:","","",""]
[15," Klaus","Flettner",15,"Keine Zeit","———","",{"$error":"#VALUE!"},"","Fahrer"," ","mit der StartNr. ",",hat erfolgreich die Prüfung SP8 absolviert. Zeit:","","",""]
[16," Heinz","Frey",16,"Keine Zeit","———","",{"$error":"#VALUE!"},"","Fahrer"," ","mit der StartNr. ",",hat erfolgreich die Prüfung SP8 absolviert. Zeit:","","",""]
[17," Henning","Reichel",17,"Keine Zeit","———","",{"$error":"#VALUE!"},"","Fahrer"," ","mit der StartNr. ",",hat erfolgreich die Prüfung SP8 absolviert. Zeit:","","",""]
[18," Maik","Käbisch",18,"Keine Zeit","———","",{"$error":"#VALUE!"},"","Fahrer"," ","mit der StartNr. ",",hat erfolgreich die Prüfung SP8 absolviert. Zeit:","","",""]
[19," Harald","Zapp",19,"Keine Zeit","———","",{"$error":"#VALUE!"},"","Fahrer"," ","mit der StartNr. ",",hat erfolgreich die Prüfung SP8 absolviert. Zeit:","","",""]
[20," Reinhard","Grzesik",20,"Keine Zeit","———","",{"$error":"#VALUE!"},"","Fahrer"," ","mit der StartNr. ",",hat erfolgreich die Prüfung SP8 absolviert. Zeit:","","",""]
[21," Jörg","Sihler",21,"Keine Zeit","———","",{"$error":"#VALUE!"},"","Fahrer"," ","mit der StartNr. ",",hat erfolgreich die Prüfung SP8 absolviert. Zeit:","","",""]
[22," Ingo","Winterstein",22,"Keine Zeit","———","",{"$error":"#VALUE!"},"","Fahrer"," ","mit der StartNr. ",",hat erfolgreich die Prüfung SP8 absolviert. Zeit:","","",""]
[23," Hans Werner","Melchior",23,"Keine Zeit","———","",{"$error":"#VALUE!"},"","Fahrer"," ","mit der StartNr. ",",hat erfolgreich die Prüfung SP8 absolviert. Zeit:","","",""]
[24," Marco","Oriolo",24,"Keine Zeit","———","",{"$error":"#VALUE!"},"","Fahrer"," ","mit der StartNr. ",",hat erfolgreich die Prüfung SP8 absolviert. Zeit:","","",""]
[25," Manfred","Stommel",25,"Keine Zeit","———","",{"$error":"#VALUE!"},"","Fahrer"," ","mit der StartNr. ",",hat erfolgreich die Prüfung SP8 absolviert. Zeit:","","",""]
[26," Carolin","Heusel",26,"Keine Zeit","———","",{"$error":"#VALUE!"},"","Fahrer"," ","mit der StartNr. ",",hat erfolgreich die Prüfung SP8 absolviert. Zeit:","","",""]
[27," Regina","Philippi",27,"Keine Zeit","———","",{"$error":"#VALUE!"},"","Fahrer"," ","mit der StartNr. ",",hat erfolgreich die Prüfung SP8 absolviert. Zeit:","","",""]
[28," Christof","Aha",28,"Keine Zeit","———","",{"$error":"#VALUE!"},"","Fahrer"," ","mit der StartNr. ",",hat erfolgreich die Prüfung SP8 absolviert. Zeit:","","",""]
[29," Dennis","Weiss",29,"Keine Zeit","———","",{"$error":"#VALUE!"},"","Fahrer"," ","mit der StartNr. ",",hat erfolgreich die Prüfung SP8 absolviert. Zeit:","","",""]
[30," Harald","Hamprecht",30,"Keine Zeit","———","",{"$error":"#VALUE!"},"","Fahrer"," ","mit der StartNr. ",",hat erfolgreich die Prüfung SP8 absolviert. Zeit:","","",""]
[31," Reno","Fiolic",31,"Keine Zeit","———","",{"$error":"#VALUE!"},"","Fahrer"," ","mit der StartNr. ",",hat erfolgreich die Prüfung SP8 absolviert. Zeit:","","",""]
[32," Jürgen","Kulpe",32,"Keine Zeit","———","",{"$error":"#VALUE!"},"","Fahrer"," ","mit der StartNr. ",",hat erfolgreich die Prüfung SP8 absolviert. Zeit:","","",""]
[33," Konstantin","Kovarbasic",33,"Keine Zeit","———","",{"$error":"#VALUE!"},"","Fahrer"," ","mit der StartNr. ",",hat erfolgreich die Prüfung SP8 absolviert. Zeit:","","",""]
[34," Nikolaus","Kratz",34,"Keine Zeit","———","",{"$error":"#VALUE!"},"","Fahrer"," ","mit der StartNr. ",",hat erfolgreich die Prüfung SP8 absolviert. Zeit:","","",""]
[35," Andreas","Eberhardt",35,"Keine Zeit","———","",{"$error":"#VALUE!"},"","Fahrer"," ","mit der StartNr. ",",hat erfolgreich die Prüfung SP8 absolviert. Zeit:","","",""]
[36," Gerhard","Thomas",36,"Keine Zeit","———","",{"$error":"#VALUE!"},"","Fahrer"," ","mit der StartNr. ",",hat erfolgreich die Prüfung SP8 absolviert. Zeit:","","",""]
[37," Lotzi","Kende",37,"Keine Zeit","———","",{"$error":"#VALUE!"},"","Fahrer"," ","mit der StartNr. ",",hat erfolgreich die Prüfung SP8 absolviert. Zeit:","","",""]
[38," Jockel","Winkelhock",38,"Keine Zeit","———","",{"$error":"#VALUE!"},"","Fahrer"," ","mit der StartNr. ",",hat erfolgreich die Prüfung SP8 absolviert. Zeit:","","",""]
[39," Sascha","Wilkesmann",39,"Keine Zeit","———","",{"$error":"#VALUE!"},"","Fahrer"," ","mit der StartNr. ",",hat erfolgreich die Prüfung SP8 absolviert. Zeit:","","",""]
[40," Gregor","Schulz",40,"Keine Zeit","———","",{"$error":"#VALUE!"},"","Fahrer"," ","mit der StartNr. ",",hat erfolgreich die Prüfung SP8 absolviert. Zeit:","","",""]
[41," Peer","Hildmann",41,"Keine Zeit","———","",{"$error":"#VALUE!"},"","Fahrer"," ","mit der StartNr. ",",hat erfolgreich die Prüfung SP8 absolviert. Zeit:","","",""]
[42," Mina","Tander",42,"Keine Zeit","———","",{"$error":"#VALUE!"},"","Fahrer"," ","mit der StartNr. ",",hat erfolgreich die Prüfung SP8 absolviert. Zeit:","","",""]
[43," Stefan","Iskan",43,"Keine Zeit","———","",{"$error":"#VALUE!"},"","Fahrer"," ","mit der StartNr. ",",hat erfolgreich die Prüfung SP8 absolviert. Zeit:","","",""]
[44," Jean-Philippe","Kempf",44,"Keine Zeit","———","",{"$error":"#VALUE!"},"","Fahrer"," ","mit der StartNr. ",",hat erfolgreich die Prüfung SP8 absolviert. Zeit:","","",""]
[45," Daniel","Martin",45,"Keine Zeit","———","",{"$error":"#VALUE!"},"","Fahrer"," ","mit der StartNr. ",",hat erfolgreich die Prüfung SP8 absolviert. Zeit:","","",""]
[46," Elena","Funk",46,"Keine Zeit","———","",{"$error":"#VALUE!"},"","Fahrer"," ","mit der StartNr. ",",hat erfolgreich die Prüfung SP8 absolviert. Zeit:","","",""]
[47," Hans","Mutschall",47,"Keine Zeit","———","",{"$error":"#VALUE!"},"","Fahrer"," ","mit der StartNr. ",",hat erfolgreich die Prüfung SP8 absolviert. Zeit:","","",""]
[48," Kahled","Rahman",48,"Keine Zeit","———","",{"$error":"#VALUE!"},"","Fahrer"," ","mit der StartNr. ",",hat erfolgreich die Prüfung SP8 absolviert. Zeit:","","",""]
[49," Jochen","Schwarz",49,"Keine Zeit","———","",{"$error":"#VALUE!"},"","Fahrer"," ","mit der StartNr. ",",hat erfolgreich die Prüfung SP8 absolviert. Zeit:","","",""]
[50," Axel","Nawrath",50,"Keine Zeit","———","",{"$error":"#VALUE!"},"","Fahrer"," ","mit der StartNr. ",",hat erfolgreich die Prüfung SP8 absolviert. Zeit:","","",""]
[51," Birgit","Claussen",51,"Keine Zeit","———","",{"$error":"#VALUE!"},"","Fahrer"," ","mit der StartNr. ",",hat erfolgreich die Prüfung SP8 absolviert. Zeit:","","",""]
[52," Harald","König",52,"Keine Zeit","———","",{"$error":"#VALUE!"},"","Fahrer"," ","mit der StartNr. ",",hat erfolgreich die Prüfung SP8 absolviert. Zeit:","","",""]
[53," Thomas","Blank",53,"Keine Zeit","———","",{"$error":"#VALUE!"},"","Fahrer"," ","mit der StartNr. ",",hat erfolgreich die Prüfung SP8 absolviert. Zeit:","","",""]
[54," Heidi","Eberhardt",54,"Keine Zeit","———","",{"$error":"#VALUE!"},"","Fahrer"," ","mit der StartNr. ",",hat erfolgreich die Prüfung SP8 absolviert. Zeit:","","",""]
[55," Karina","Ansos",55,"Keine Zeit","———","",{"$error":"#VALUE!"},"","Fahrer"," ","mit der StartNr. ",",hat erfolgreich die Prüfung SP8 absolviert. Zeit:","","",""]
[56," Michael","Gotta",56,"Keine Zeit","———","",{"$error":"#VALUE!"},"","Fahrer"," ","mit der StartNr. ",",hat erfolgreich die Prüfung SP8 absolviert. Zeit:","","",""]
[57," Stefanie","Rinck",57,"Keine Zeit","———","",{"$error":"#VALUE!"},"","Fahrer"," ","mit der StartNr. ",",hat erfolgreich die Prüfung SP8 absolviert. Zeit:","","",""]
[58," Armin","Slotta",58,"Keine Zeit","———","",{"$error":"#VALUE!"},"","Fahrer"," ","mit der StartNr. ",",hat erfolgreich die Prüfung SP8 absolviert. Zeit:","","",""]
[59," Julia","Kende",59,"Keine Zeit","———","",{"$error":"#VALUE!"},"","Fahrer"," ","mit der StartNr. ",",hat erfolgreich die Prüfung SP8 absolviert. Zeit:","","",""]
[60," Robert","Bleckmann",60,"Keine Zeit","———","",{"$error":"#VALUE!"},"","Fahrer"," ","mit der StartNr. ",",hat erfolgreich die Prüfung SP8 absolviert. Zeit:","","",""]
[61," Christof","Harwardt",61,"Keine Zeit","———","",{"$error":"#VALUE!"},"","Fahrer"," ","mit der StartNr. ",",hat erfolgreich die Prüfung SP8 absolviert. Zeit:","","",""]
[62," Thomas","Kahns",62,"Keine Zeit","———","",{"$error":"#VALUE!"},"","Fahrer"," ","mit der StartNr. ",",hat erfolgreich die Prüfung SP8 absolviert. Zeit:","","",""]
[63," Maximilian","Herbst",63,"Keine Zeit","———","",{"$error":"#VALUE!"},"","Fahrer"," ","mit der StartNr. ",",hat erfolgreich die Prüfung SP8 absolviert. Zeit:","","",""]
[64," Jürgen","Buchhold",64,"Keine Zeit","———","",{"$error":"#VALUE!"},"","Fahrer"," ","mit der StartNr. ",",hat erfolgreich die Prüfung SP8 absolviert. Zeit:","","",""]
[65," Oliver","Klink",65,"Keine Zeit","———","",{"$error":"#VALUE!"},"","Fahrer"," ","mit der StartNr. ",",hat erfolgreich die Prüfung SP8 absolviert. Zeit:","","",""]
[66," Peter","Bel",66,"Keine Zeit","———",{"$f":"IF(E67=\"Keine Zeit\",\"\",E67)","v":""},{"$f":"ABS(G67-$G$1)","v":{"$error":"#VALUE!"}},{"$f":"IF(G67<=$G$1,\"-\",\"\")","v":""},"Fahrer"," ","mit der StartNr. ",",hat erfolgreich die Prüfung SP8 absolviert. Zeit:",{"$f":"IF(ISERROR(H67),\"\",J67&B67&K67&C67&K67&L67&A67&K67&M67)","v":""},{"$f":"IF(ISERROR(H67),\"\",H67)","v":""},{"$f":"IF(O67=\"\",\"\",1)","v":""}]
[67," Thomas","Mirau",67,"Keine Zeit","———","",{"$error":"#VALUE!"},"","Fahrer"," ","mit der StartNr. ",",hat erfolgreich die Prüfung SP8 absolviert. Zeit:","","",""]
[68," Markus","Gotta",68,"Keine Zeit","———","",{"$error":"#VALUE!"},"","Fahrer"," ","mit der StartNr. ",",hat erfolgreich die Prüfung SP8 absolviert. Zeit:","","",""]
[69," Robin","Keulertz",69,"Keine Zeit","———","",{"$error":"#VALUE!"},"","Fahrer"," ","mit der StartNr. ",",hat erfolgreich die Prüfung SP8 absolviert. Zeit:","","",""]
[70," Christian","Häp",70,"Keine Zeit","———","",{"$error":"#VALUE!"},"","Fahrer"," ","mit der StartNr. ",",hat erfolgreich die Prüfung SP8 absolviert. Zeit:","","",""]
[71," Ingolf","Zschockelt",71,"Keine Zeit","———","",{"$error":"#VALUE!"},"","Fahrer"," ","mit der StartNr. ",",hat erfolgreich die Prüfung SP8 absolviert. Zeit:","","",""]
[72," Michael","Barsties",72,"Keine Zeit","———","",{"$error":"#VALUE!"},"","Fahrer"," ","mit der StartNr. ",",hat erfolgreich die Prüfung SP8 absolviert. Zeit:","","",""]
[73," Ramona","Wagner",73,"Keine Zeit","———","",{"$error":"#VALUE!"},"","Fahrer"," ","mit der StartNr. ",",hat erfolgreich die Prüfung SP8 absolviert. Zeit:","","",""]
[74," Lars","Fahrenbach",74,"Keine Zeit","———","",{"$error":"#VALUE!"},"","Fahrer"," ","mit der StartNr. ",",hat erfolgreich die Prüfung SP8 absolviert. Zeit:","","",""]
[75," Frank","Hoefnagels",75,"Keine Zeit","———","",{"$error":"#VALUE!"},"","Fahrer"," ","mit der StartNr. ",",hat erfolgreich die Prüfung SP8 absolviert. Zeit:","","",""]
[76," Michael","Karch",76,"Keine Zeit","———","",{"$error":"#VALUE!"},"","Fahrer"," ","mit der StartNr. ",",hat erfolgreich die Prüfung SP8 absolviert. Zeit:","","",""]
[77," Dirk","Götze",77,"Keine Zeit","———","",{"$error":"#VALUE!"},"","Fahrer"," ","mit der StartNr. ",",hat erfolgreich die Prüfung SP8 absolviert. Zeit:","","",""]
[78," Stefan","Hillers",78,"Keine Zeit","———","",{"$error":"#VALUE!"},"","Fahrer"," ","mit der StartNr. ",",hat erfolgreich die Prüfung SP8 absolviert. Zeit:","","",""]
[79," Christian","Rafflenbeul",79,"Keine Zeit","———","",{"$error":"#VALUE!"},"","Fahrer"," ","mit der StartNr. ",",hat erfolgreich die Prüfung SP8 absolviert. Zeit:","","",""]
[80," Gerhard","Reuschel",80,"Keine Zeit","———","",{"$error":"#VALUE!"},"","Fahrer"," ","mit der StartNr. ",",hat erfolgreich die Prüfung SP8 absolviert. Zeit:","","",""]
[81," Karsten","Rachow",81,"Keine Zeit","———","",{"$error":"#VALUE!"},"","Fahrer"," ","mit der StartNr. ",",hat erfolgreich die Prüfung SP8 absolviert. Zeit:","","",""]
[82," Jürgen","Ziller",82,"Keine Zeit","———","",{"$error":"#VALUE!"},"","Fahrer"," ","mit der StartNr. ",",hat erfolgreich die Prüfung SP8 absolviert. Zeit:","","",""]
[83," Alexander","Weil",83,"Keine Zeit","———","",{"$error":"#VALUE!"},"","Fahrer"," ","mit der StartNr. ",",hat erfolgreich die Prüfung SP8 absolviert. Zeit:","","",""]
[84," Josef","Lindenberger",84,"Keine Zeit","———","",{"$error":"#VALUE!"},"","Fahrer"," ","mit der StartNr. ",",hat erfolgreich die Prüfung SP8 absolviert. Zeit:","","",""]
[85," Rick","Durante",85,"Keine Zeit","———","",{"$error":"#VALUE!"},"","Fahrer"," ","mit der StartNr. ",",hat erfolgreich die Prüfung SP8 absolviert. Zeit:","","",""]
[86," Almuth","Siemann",86,"Keine Zeit","———","",{"$error":"#VALUE!"},"","Fahrer"," ","mit der StartNr. ",",hat erfolgreich die Prüfung SP8 absolviert. Zeit:","","",""]
[87," Axel","Strigl",87,"Keine Zeit","———","",{"$error":"#VALUE!"},"","Fahrer"," ","mit der StartNr. ",",hat erfolgreich die Prüfung SP8 absolviert. Zeit:","","",""]
[88," Philip","Sommer",88,"Keine Zeit","———","",{"$error":"#VALUE!"},"","Fahrer"," ","mit der StartNr. ",",hat erfolgreich die Prüfung SP8 absolviert. Zeit:","","",""]
[89," Jörg","Diehl",89,"Keine Zeit","———","",{"$error":"#VALUE!"},"","Fahrer"," ","mit der StartNr. ",",hat erfolgreich die Prüfung SP8 absolviert. Zeit:","","",""]
[90," Matthias","Herzig",90,"Keine Zeit","———","",{"$error":"#VALUE!"},"","Fahrer"," ","mit der StartNr. ",",hat erfolgreich die Prüfung SP8 absolviert. Zeit:","","",""]
[91," Christoph","Pasternak",91,"Keine Zeit","———","",{"$error":"#VALUE!"},"","Fahrer"," ","mit der StartNr. ",",hat erfolgreich die Prüfung SP8 absolviert. Zeit:","","",""]
[92," Lothar","Schupet",92,"Keine Zeit","———","",{"$error":"#VALUE!"},"","Fahrer"," ","mit der StartNr. ",",hat erfolgreich die Prüfung SP8 absolviert. Zeit:","","",""]
[93," Wolfgang","Schertler",93,"Keine Zeit","———","",{"$error":"#VALUE!"},"","Fahrer"," ","mit der StartNr. ",",hat erfolgreich die Prüfung SP8 absolviert. Zeit:","","",""]
[94," Thomas","Katzensteiner",94,"Keine Zeit","———","",{"$error":"#VALUE!"},"","Fahrer"," ","mit der StartNr. ",",hat erfolgreich die Prüfung SP8 absolviert. Zeit:","","",""]
[95," Hagen","Hackenberg",95,"Keine Zeit","———","",{"$error":"#VALUE!"},"","Fahrer"," ","mit der StartNr. ",",hat erfolgreich die Prüfung SP8 absolviert. Zeit:","","",""]
[96," Oliver","Dietz",96,"Keine Zeit","———","",{"$error":"#VALUE!"},"","Fahrer"," ","mit der StartNr. ",",hat erfolgreich die Prüfung SP8 absolviert. Zeit:","","",""]
[97," Horst","Kempf",97,"Keine Zeit","———","",{"$error":"#VALUE!"},"","Fahrer"," ","mit der StartNr. ",",hat erfolgreich die Prüfung SP8 absolviert. Zeit:","","",""]
[98," Detlev","Pauer",98,"Keine Zeit","———","",{"$error":"#VALUE!"},"","Fahrer"," ","mit der StartNr. ",",hat erfolgreich die Prüfung SP8 absolviert. Zeit:","","",""]
[99," Dirk","Velte",99,"Keine Zeit","———","",{"$error":"#VALUE!"},"","Fahrer"," ","mit der StartNr. ",",hat erfolgreich die Prüfung SP8 absolviert. Zeit:","","",""]
[100," Thorsten","Krack",100,"Keine Zeit","———","",{"$error":"#VALUE!"},"","Fahrer"," ","mit der StartNr. ",",hat erfolgreich die Prüfung SP8 absolviert. Zeit:","","",""]
[101," Christian","Wittek",101,"Keine Zeit","———","",{"$error":"#VALUE!"},"","Fahrer"," ","mit der StartNr. ",",hat erfolgreich die Prüfung SP8 absolviert. Zeit:","","",""]
[102," Benjamin","Hix",102,"Keine Zeit","———","",{"$error":"#VALUE!"},"","Fahrer"," ","mit der StartNr. ",",hat erfolgreich die Prüfung SP8 absolviert. Zeit:","","",""]
[null,null,null,null,null,null,null,null,null,null,null,null,null,null,null,{"$f":"SUM(P2:P103)","v":0}]

{"sheet":"Export_SP1","index":8,"n_rows":102,"n_cols":4,"rows_kept":102,"cut":false,"hidden":false,"merged":[]}
[{"$f":"SP1_Sprint!G2","v":"00:00:07,51"},{"$f":"SP1_Sprint!H2","v":"00:00:00.510"},{"$f":"SP1_Sprint!O2","v":"Fahrer Christian Jäger mit der StartNr. 1 ,hat erfolgreich die Prüfung SP1 absolviert. Zeit:   "},{"$f":"SP1_Sprint!P2","v":"00:00:00.510"}]
[{"$f":"SP1_Sprint!G3","v":"00:00:07,51"},{"$f":"SP1_Sprint!H3","v":"00:00:00.510"},{"$f":"SP1_Sprint!O3","v":"Fahrer Daniel Rinck mit der StartNr. 2 ,hat erfolgreich die Prüfung SP1 absolviert. Zeit:   "},{"$f":"SP1_Sprint!P3","v":"00:00:00.510"}]
[{"$f":"SP1_Sprint!G4","v":"00:00:08,31"},{"$f":"SP1_Sprint!H4","v":"00:00:01.310"},{"$f":"SP1_Sprint!O4","v":"Fahrer Malte Proff-Klein mit der StartNr. 3 ,hat erfolgreich die Prüfung SP1 absolviert. Zeit:   "},{"$f":"SP1_Sprint!P4","v":"00:00:01.310"}]
[{"$f":"SP1_Sprint!G5","v":"00:00:07,45"},{"$f":"SP1_Sprint!H5","v":"00:00:00.450"},{"$f":"SP1_Sprint!O5","v":"Fahrer Dietmar Siemssen mit der StartNr. 4 ,hat erfolgreich die Prüfung SP1 absolviert. Zeit:   "},{"$f":"SP1_Sprint!P5","v":"00:00:00.450"}]
[{"$f":"SP1_Sprint!G6","v":"00:00:11,97"},{"$f":"SP1_Sprint!H6","v":"00:00:04.970"},{"$f":"SP1_Sprint!O6","v":"Fahrer Franz-Michael Hartmann mit der StartNr. 5 ,hat erfolgreich die Prüfung SP1 absolviert. Zeit:   "},{"$f":"SP1_Sprint!P6","v":"00:00:04.970"}]
[{"$f":"SP1_Sprint!G7","v":"00:00:07,77"},{"$f":"SP1_Sprint!H7","v":"00:00:00.770"},{"$f":"SP1_Sprint!O7","v":"Fahrer Christoph Schroer mit der StartNr. 6 ,hat erfolgreich die Prüfung SP1 absolviert. Zeit:   "},{"$f":"SP1_Sprint!P7","v":"00:00:00.770"}]
[{"$f":"SP1_Sprint!G8","v":"00:00:09,02"},{"$f":"SP1_Sprint!H8","v":"00:00:02.020"},{"$f":"SP1_Sprint!O8","v":"Fahrer Jochen Artzinger-Bolten mit der StartNr. 7 ,hat erfolgreich die Prüfung SP1 absolviert. Zeit:   "},{"$f":"SP1_Sprint!P8","v":"00:00:02.020"}]
[{"$f":"SP1_Sprint!G9","v":"00:00:09,41"},{"$f":"SP1_Sprint!H9","v":"00:00:02.410"},{"$f":"SP1_Sprint!O9","v":"Fahrer Friedhelm Eickhorn mit der StartNr. 8 ,hat erfolgreich die Prüfung SP1 absolviert. Zeit:   "},{"$f":"SP1_Sprint!P9","v":"00:00:02.410"}]
[{"$f":"SP1_Sprint!G10","v":"00:00:08,84"},{"$f":"SP1_Sprint!H10","v":"00:00:01.840"},{"$f":"SP1_Sprint!O10","v":"Fahrer Carsten Reblin mit der StartNr. 9 ,hat erfolgreich die Prüfung SP1 absolviert. Zeit:   "},{"$f":"SP1_Sprint!P10","v":"00:00:01.840"}]
[{"$f":"SP1_Sprint!G11","v":"00:00:08,51"},{"$f":"SP1_Sprint!H11","v":"00:00:01.510"},{"$f":"SP1_Sprint!O11","v":"Fahrer Dieter Dinges mit der StartNr. 10 ,hat erfolgreich die Prüfung SP1 absolviert. Zeit:   "},{"$f":"SP1_Sprint!P11","v":"00:00:01.510"}]
[{"$f":"SP1_Sprint!G12","v":"00:00:09,83"},{"$f":"SP1_Sprint!H12","v":"00:00:02.830"},{"$f":"SP1_Sprint!O12","v":"Fahrer Wolfgang Reeh mit der StartNr. 11 ,hat erfolgreich die Prüfung SP1 absolviert. Zeit:   "},{"$f":"SP1_Sprint!P12","v":"00:00:02.830"}]
[{"$f":"SP1_Sprint!G13","v":"00:00:07,79"},{"$f":"SP1_Sprint!H13","v":"00:00:00.790"},{"$f":"SP1_Sprint!O13","v":"Fahrer Andreas Petry mit der StartNr. 12 ,hat erfolgreich die Prüfung SP1 absolviert. Zeit:   "},{"$f":"SP1_Sprint!P13","v":"00:00:00.790"}]
[{"$f":"SP1_Sprint!G14","v":"00:00:08,35"},{"$f":"SP1_Sprint!H14","v":"00:00:01.350"},{"$f":"SP1_Sprint!O14","v":"Fahrer Ted Prenzel mit der StartNr. 13 ,hat erfolgreich die Prüfung SP1 absolviert. Zeit:   "},{"$f":"SP1_Sprint!P14","v":"00:00:01.350"}]
[{"$f":"SP1_Sprint!G15","v":"00:00:06,13"},{"$f":"SP1_Sprint!H15","v":"00:00:00.870"},{"$f":"SP1_Sprint!O15","v":"Fahrer Micha Barsties mit der StartNr. 14 ,hat erfolgreich die Prüfung SP1 absolviert. Zeit:   "},{"$f":"SP1_Sprint!P15","v":"00:00:00.870"}]
[{"$f":"SP1_Sprint!G16","v":"00:00:08,11"},{"$f":"SP1_Sprint!H16","v":"00:00:01.110"},{"$f":"SP1_Sprint!O16","v":"Fahrer Klaus Flettner mit der StartNr. 15 ,hat erfolgreich die Prüfung SP1 absolviert. Zeit:   "},{"$f":"SP1_Sprint!P16","v":"00:00:01.110"}]
[{"$f":"SP1_Sprint!G17","v":"00:00:07,58"},{"$f":"SP1_Sprint!H17","v":"00:00:00.580"},{"$f":"SP1_Sprint!O17","v":"Fahrer Heinz Frey mit der StartNr. 16 ,hat erfolgreich die Prüfung SP1 absolviert. Zeit:   "},{"$f":"SP1_Sprint!P17","v":"00:00:00.580"}]
[{"$f":"SP1_Sprint!G18","v":"00:00:08,49"},{"$f":"SP1_Sprint!H18","v":"00:00:01.490"},{"$f":"SP1_Sprint!O18","v":"Fahrer Henning Reichel mit der StartNr. 17 ,hat erfolgreich die Prüfung SP1 absolviert. Zeit:   "},{"$f":"SP1_Sprint!P18","v":"00:00:01.490"}]
[{"$f":"SP1_Sprint!G19","v":"00:00:07,29"},{"$f":"SP1_Sprint!H19","v":"00:00:00.290"},{"$f":"SP1_Sprint!O19","v":"Fahrer Maik Käbisch mit der StartNr. 18 ,hat erfolgreich die Prüfung SP1 absolviert. Zeit:   "},{"$f":"SP1_Sprint!P19","v":"00:00:00.290"}]
[{"$f":"SP1_Sprint!G20","v":"00:00:07,61"},{"$f":"SP1_Sprint!H20","v":"00:00:00.610"},{"$f":"SP1_Sprint!O20","v":"Fahrer Harald Zapp mit der StartNr. 19 ,hat erfolgreich die Prüfung SP1 absolviert. Zeit:   "},{"$f":"SP1_Sprint!P20","v":"00:00:00.610"}]
[{"$f":"SP1_Sprint!G21","v":"00:00:08,88"},{"$f":"SP1_Sprint!H21","v":"00:00:01.880"},{"$f":"SP1_Sprint!O21","v":"Fahrer Reinhard Grzesik mit der StartNr. 20 ,hat erfolgreich die Prüfung SP1 absolviert. Zeit:   "},{"$f":"SP1_Sprint!P21","v":"00:00:01.880"}]
[{"$f":"SP1_Sprint!G22","v":"00:00:08,00"},{"$f":"SP1_Sprint!H22","v":"00:00:01"},{"$f":"SP1_Sprint!O22","v":"Fahrer Jörg Sihler mit der StartNr. 21 ,hat erfolgreich die Prüfung SP1 absolviert. Zeit:   "},{"$f":"SP1_Sprint!P22","v":"00:00:01"}]
[{"$f":"SP1_Sprint!G23","v":"00:00:08,56"},{"$f":"SP1_Sprint!H23","v":"00:00:01.560"},{"$f":"SP1_Sprint!O23","v":"Fahrer Ingo Winterstein mit der StartNr. 22 ,hat erfolgreich die Prüfung SP1 absolviert. Zeit:   "},{"$f":"SP1_Sprint!P23","v":"00:00:01.560"}]
[{"$f":"SP1_Sprint!G24","v":"00:00:06,88"},{"$f":"SP1_Sprint!H24","v":"00:00:00.120"},{"$f":"SP1_Sprint!O24","v":"Fahrer Hans Werner Melchior mit der StartNr. 23 ,hat erfolgreich die Prüfung SP1 absolviert. Zeit:   "},{"$f":"SP1_Sprint!P24","v":"00:00:00.120"}]
[{"$f":"SP1_Sprint!G25","v":"00:00:06,56"},{"$f":"SP1_Sprint!H25","v":"00:00:00.440"},{"$f":"SP1_Sprint!O25","v":"Fahrer Marco Oriolo mit der StartNr. 24 ,hat erfolgreich die Prüfung SP1 absolviert. Zeit:   "},{"$f":"SP1_Sprint!P25","v":"00:00:00.440"}]
[{"$f":"SP1_Sprint!G26","v":"00:00:10,79"},{"$f":"SP1_Sprint!H26","v":"00:00:03.790"},{"$f":"SP1_Sprint!O26","v":"Fahrer Manfred Stommel mit der StartNr. 25 ,hat erfolgreich die Prüfung SP1 absolviert. Zeit:   "},{"$f":"SP1_Sprint!P26","v":"00:00:03.790"}]
[{"$f":"SP1_Sprint!G27","v":"00:00:07,38"},{"$f":"SP1_Sprint!H27","v":"00:00:00.380"},{"$f":"SP1_Sprint!O27","v":"Fahrer Carolin Heusel mit der StartNr. 26 ,hat erfolgreich die Prüfung SP1 absolviert. Zeit:   "},{"$f":"SP1_Sprint!P27","v":"00:00:00.380"}]
[{"$f":"SP1_Sprint!G28","v":"00:00:09,54"},{"$f":"SP1_Sprint!H28","v":"00:00:02.540"},{"$f":"SP1_Sprint!O28","v":"Fahrer Regina Philippi mit der StartNr. 27 ,hat erfolgreich die Prüfung SP1 absolviert. Zeit:   "},{"$f":"SP1_Sprint!P28","v":"00:00:02.540"}]
[{"$f":"SP1_Sprint!G29","v":"00:00:09,32"},{"$f":"SP1_Sprint!H29","v":"00:00:02.320"},{"$f":"SP1_Sprint!O29","v":"Fahrer Christof Aha mit der StartNr. 28 ,hat erfolgreich die Prüfung SP1 absolviert. Zeit:   "},{"$f":"SP1_Sprint!P29","v":"00:00:02.320"}]
[{"$f":"SP1_Sprint!G30","v":"00:00:08,89"},{"$f":"SP1_Sprint!H30","v":"00:00:01.890"},{"$f":"SP1_Sprint!O30","v":"Fahrer Dennis Weiss mit der StartNr. 29 ,hat erfolgreich die Prüfung SP1 absolviert. Zeit:   "},{"$f":"SP1_Sprint!P30","v":"00:00:01.890"}]
[{"$f":"SP1_Sprint!G31","v":"00:00:07,26"},{"$f":"SP1_Sprint!H31","v":"00:00:00.260"},{"$f":"SP1_Sprint!O31","v":"Fahrer Harald Hamprecht mit der StartNr. 30 ,hat erfolgreich die Prüfung SP1 absolviert. Zeit:   "},{"$f":"SP1_Sprint!P31","v":"00:00:00.260"}]
[{"$f":"SP1_Sprint!G32","v":"00:00:09,61"},{"$f":"SP1_Sprint!H32","v":"00:00:02.610"},{"$f":"SP1_Sprint!O32","v":"Fahrer Reno Fiolic mit der StartNr. 31 ,hat erfolgreich die Prüfung SP1 absolviert. Zeit:   "},{"$f":"SP1_Sprint!P32","v":"00:00:02.610"}]
[{"$f":"SP1_Sprint!G33","v":"00:00:10,66"},{"$f":"SP1_Sprint!H33","v":"00:00:03.660"},{"$f":"SP1_Sprint!O33","v":"Fahrer Jürgen Kulpe mit der StartNr. 32 ,hat erfolgreich die Prüfung SP1 absolviert. Zeit:   "},{"$f":"SP1_Sprint!P33","v":"00:00:03.660"}]
[{"$f":"SP1_Sprint!G34","v":"00:00:13,66"},{"$f":"SP1_Sprint!H34","v":"00:00:06.660"},{"$f":"SP1_Sprint!O34","v":"Fahrer Konstantin Kovarbasic mit der StartNr. 33 ,hat erfolgreich die Prüfung SP1 absolviert. Zeit:   "},{"$f":"SP1_Sprint!P34","v":"00:00:06.660"}]
[{"$f":"SP1_Sprint!G35","v":"00:00:07,76"},{"$f":"SP1_Sprint!H35","v":"00:00:00.760"},{"$f":"SP1_Sprint!O35","v":"Fahrer Nikolaus Kratz mit der StartNr. 34 ,hat erfolgreich die Prüfung SP1 absolviert. Zeit:   "},{"$f":"SP1_Sprint!P35","v":"00:00:00.760"}]
[{"$f":"SP1_Sprint!G36","v":"00:00:07,80"},{"$f":"SP1_Sprint!H36","v":"00:00:00.800"},{"$f":"SP1_Sprint!O36","v":"Fahrer Andreas Eberhardt mit der StartNr. 35 ,hat erfolgreich die Prüfung SP1 absolviert. Zeit:   "},{"$f":"SP1_Sprint!P36","v":"00:00:00.800"}]
[{"$f":"SP1_Sprint!G37","v":"00:00:06,07"},{"$f":"SP1_Sprint!H37","v":"00:00:00.930"},{"$f":"SP1_Sprint!O37","v":"Fahrer Gerhard Thomas mit der StartNr. 36 ,hat erfolgreich die Prüfung SP1 absolviert. Zeit:   "},{"$f":"SP1_Sprint!P37","v":"00:00:00.930"}]
[{"$f":"SP1_Sprint!G38","v":"00:00:07,51"},{"$f":"SP1_Sprint!H38","v":"00:00:00.510"},{"$f":"SP1_Sprint!O38","v":"Fahrer Lotzi Kende mit der StartNr. 37 ,hat erfolgreich die Prüfung SP1 absolviert. Zeit:   "},{"$f":"SP1_Sprint!P38","v":"00:00:00.510"}]
[{"$f":"SP1_Sprint!G39","v":"00:00:10,45"},{"$f":"SP1_Sprint!H39","v":"00:00:03.450"},{"$f":"SP1_Sprint!O39","v":"Fahrer Jockel Winkelhock mit der StartNr. 38 ,hat erfolgreich die Prüfung SP1 absolviert. Zeit:   "},{"$f":"SP1_Sprint!P39","v":"00:00:03.450"}]
[{"$f":"SP1_Sprint!G40","v":"00:00:09,17"},{"$f":"SP1_Sprint!H40","v":"00:00:02.170"},{"$f":"SP1_Sprint!O40","v":"Fahrer Sascha Wilkesmann mit der StartNr. 39 ,hat erfolgreich die Prüfung SP1 absolviert. Zeit:   "},{"$f":"SP1_Sprint!P40","v":"00:00:02.170"}]
[{"$f":"SP1_Sprint!G41","v":"00:00:09,35"},{"$f":"SP1_Sprint!H41","v":"00:00:02.350"},{"$f":"SP1_Sprint!O41","v":"Fahrer Gregor Schulz mit der StartNr. 40 ,hat erfolgreich die Prüfung SP1 absolviert. Zeit:   "},{"$f":"SP1_Sprint!P41","v":"00:00:02.350"}]
[{"$f":"SP1_Sprint!G42","v":"00:00:07,20"},{"$f":"SP1_Sprint!H42","v":"00:00:00.200"},{"$f":"SP1_Sprint!O42","v":"Fahrer Peer Hildmann mit der StartNr. 41 ,hat erfolgreich die Prüfung SP1 absolviert. Zeit:   "},{"$f":"SP1_Sprint!P42","v":"00:00:00.200"}]
[{"$f":"SP1_Sprint!G43","v":"00:00:11,57"},{"$f":"SP1_Sprint!H43","v":"00:00:04.570"},{"$f":"SP1_Sprint!O43","v":"Fahrer Mina Tander mit der StartNr. 42 ,hat erfolgreich die Prüfung SP1 absolviert. Zeit:   "},{"$f":"SP1_Sprint!P43","v":"00:00:04.570"}]
[{"$f":"SP1_Sprint!G44","v":"00:00:08,42"},{"$f":"SP1_Sprint!H44","v":"00:00:01.420"},{"$f":"SP1_Sprint!O44","v":"Fahrer Stefan Iskan mit der StartNr. 43 ,hat erfolgreich die Prüfung SP1 absolviert. Zeit:   "},{"$f":"SP1_Sprint!P44","v":"00:00:01.420"}]
[{"$f":"SP1_Sprint!G45","v":"00:00:08,28"},{"$f":"SP1_Sprint!H45","v":"00:00:01.280"},{"$f":"SP1_Sprint!O45","v":"Fahrer Jean-Philippe Kempf mit der StartNr. 44 ,hat erfolgreich die Prüfung SP1 absolviert. Zeit:   "},{"$f":"SP1_Sprint!P45","v":"00:00:01.280"}]
[{"$f":"SP1_Sprint!G46","v":"00:00:07,35"},{"$f":"SP1_Sprint!H46","v":"00:00:00.350"},{"$f":"SP1_Sprint!O46","v":"Fahrer Daniel Martin mit der StartNr. 45 ,hat erfolgreich die Prüfung SP1 absolviert. Zeit:   "},{"$f":"SP1_Sprint!P46","v":"00:00:00.350"}]
[{"$f":"SP1_Sprint!G47","v":"00:00:08,35"},{"$f":"SP1_Sprint!H47","v":"00:00:01.350"},{"$f":"SP1_Sprint!O47","v":"Fahrer Elena Funk mit der StartNr. 46 ,hat erfolgreich die Prüfung SP1 absolviert. Zeit:   "},{"$f":"SP1_Sprint!P47","v":"00:00:01.350"}]
[{"$f":"SP1_Sprint!G48","v":"00:00:07,58"},{"$f":"SP1_Sprint!H48","v":"00:00:00.580"},{"$f":"SP1_Sprint!O48","v":"Fahrer Hans Mutschall mit der StartNr. 47 ,hat erfolgreich die Prüfung SP1 absolviert. Zeit:   "},{"$f":"SP1_Sprint!P48","v":"00:00:00.580"}]
[{"$f":"SP1_Sprint!G49","v":"00:00:08,65"},{"$f":"SP1_Sprint!H49","v":"00:00:01.650"},{"$f":"SP1_Sprint!O49","v":"Fahrer Kahled Rahman mit der StartNr. 48 ,hat erfolgreich die Prüfung SP1 absolviert. Zeit:   "},{"$f":"SP1_Sprint!P49","v":"00:00:01.650"}]
[{"$f":"SP1_Sprint!G50","v":"00:00:07,13"},{"$f":"SP1_Sprint!H50","v":"00:00:00.130"},{"$f":"SP1_Sprint!O50","v":"Fahrer Jochen Schwarz mit der StartNr. 49 ,hat erfolgreich die Prüfung SP1 absolviert. Zeit:   "},{"$f":"SP1_Sprint!P50","v":"00:00:00.130"}]
[{"$f":"SP1_Sprint!G51","v":""},{"$f":"SP1_Sprint!H51","v":{"$error":"#VALUE!"}},{"$f":"SP1_Sprint!O51","v":""},{"$f":"SP1_Sprint!P51","v":""}]
[{"$f":"SP1_Sprint!G52","v":"00:00:08,27"},{"$f":"SP1_Sprint!H52","v":"00:00:01.270"},{"$f":"SP1_Sprint!O52","v":"Fahrer Birgit Claussen mit der StartNr. 51 ,hat erfolgreich die Prüfung SP1 absolviert. Zeit:   "},{"$f":"SP1_Sprint!P52","v":"00:00:01.270"}]
[{"$f":"SP1_Sprint!G53","v":"00:00:08,08"},{"$f":"SP1_Sprint!H53","v":"00:00:01.080"},{"$f":"SP1_Sprint!O53","v":"Fahrer Harald König mit der StartNr. 52 ,hat erfolgreich die Prüfung SP1 absolviert. Zeit:   "},{"$f":"SP1_Sprint!P53","v":"00:00:01.080"}]
[{"$f":"SP1_Sprint!G54","v":"00:00:07,19"},{"$f":"SP1_Sprint!H54","v":"00:00:00.190"},{"$f":"SP1_Sprint!O54","v":"Fahrer Thomas Blank mit der StartNr. 53 ,hat erfolgreich die Prüfung SP1 absolviert. Zeit:   "},{"$f":"SP1_Sprint!P54","v":"00:00:00.190"}]
[{"$f":"SP1_Sprint!G55","v":"00:00:08,14"},{"$f":"SP1_Sprint!H55","v":"00:00:01.140"},{"$f":"SP1_Sprint!O55","v":"Fahrer Heidi Eberhardt mit der StartNr. 54 ,hat erfolgreich die Prüfung SP1 absolviert. Zeit:   "},{"$f":"SP1_Sprint!P55","v":"00:00:01.140"}]
[{"$f":"SP1_Sprint!G56","v":"00:00:06,72"},{"$f":"SP1_Sprint!H56","v":"00:00:00.280"},{"$f":"SP1_Sprint!O56","v":"Fahrer Karina Ansos mit der StartNr. 55 ,hat erfolgreich die Prüfung SP1 absolviert. Zeit:   "},{"$f":"SP1_Sprint!P56","v":"00:00:00.280"}]
[{"$f":"SP1_Sprint!G57","v":"00:00:08,35"},{"$f":"SP1_Sprint!H57","v":"00:00:01.350"},{"$f":"SP1_Sprint!O57","v":"Fahrer Michael Gotta mit der StartNr. 56 ,hat erfolgreich die Prüfung SP1 absolviert. Zeit:   "},{"$f":"SP1_Sprint!P57","v":"00:00:01.350"}]
[{"$f":"SP1_Sprint!G58","v":"00:00:07,76"},{"$f":"SP1_Sprint!H58","v":"00:00:00.760"},{"$f":"SP1_Sprint!O58","v":"Fahrer Stefanie Rinck mit der StartNr. 57 ,hat erfolgreich die Prüfung SP1 absolviert. Zeit:   "},{"$f":"SP1_Sprint!P58","v":"00:00:00.760"}]
[{"$f":"SP1_Sprint!G59","v":"00:00:08,20"},{"$f":"SP1_Sprint!H59","v":"00:00:01.200"},{"$f":"SP1_Sprint!O59","v":"Fahrer Armin Slotta mit der StartNr. 58 ,hat erfolgreich die Prüfung SP1 absolviert. Zeit:   "},{"$f":"SP1_Sprint!P59","v":"00:00:01.200"}]
[{"$f":"SP1_Sprint!G60","v":"00:00:07,42"},{"$f":"SP1_Sprint!H60","v":"00:00:00.420"},{"$f":"SP1_Sprint!O60","v":"Fahrer Julia Kende mit der StartNr. 59 ,hat erfolgreich die Prüfung SP1 absolviert. Zeit:   "},{"$f":"SP1_Sprint!P60","v":"00:00:00.420"}]
[{"$f":"SP1_Sprint!G61","v":"00:00:07,88"},{"$f":"SP1_Sprint!H61","v":"00:00:00.880"},{"$f":"SP1_Sprint!O61","v":"Fahrer Robert Bleckmann mit der StartNr. 60 ,hat erfolgreich die Prüfung SP1 absolviert. Zeit:   "},{"$f":"SP1_Sprint!P61","v":"00:00:00.880"}]
[{"$f":"SP1_Sprint!G62","v":"00:00:07,52"},{"$f":"SP1_Sprint!H62","v":"00:00:00.520"},{"$f":"SP1_Sprint!O62","v":"Fahrer Christof Harwardt mit der StartNr. 61 ,hat erfolgreich die Prüfung SP1 absolviert. Zeit:   "},{"$f":"SP1_Sprint!P62","v":"00:00:00.520"}]
[{"$f":"SP1_Sprint!G63","v":"00:00:08,76"},{"$f":"SP1_Sprint!H63","v":"00:00:01.760"},{"$f":"SP1_Sprint!O63","v":"Fahrer Thomas Kahns mit der StartNr. 62 ,hat erfolgreich die Prüfung SP1 absolviert. Zeit:   "},{"$f":"SP1_Sprint!P63","v":"00:00:01.760"}]
[{"$f":"SP1_Sprint!G64","v":"00:00:06,48"},{"$f":"SP1_Sprint!H64","v":"00:00:00.520"},{"$f":"SP1_Sprint!O64","v":"Fahrer Maximilian Herbst mit der StartNr. 63 ,hat erfolgreich die Prüfung SP1 absolviert. Zeit:   "},{"$f":"SP1_Sprint!P64","v":"00:00:00.520"}]
[{"$f":"SP1_Sprint!G65","v":"00:00:07,06"},{"$f":"SP1_Sprint!H65","v":"00:00:00.060"},{"$f":"SP1_Sprint!O65","v":"Fahrer Jürgen Buchhold mit der StartNr. 64 ,hat erfolgreich die Prüfung SP1 absolviert. Zeit:   "},{"$f":"SP1_Sprint!P65","v":"00:00:00.060"}]
[{"$f":"SP1_Sprint!G66","v":""},{"$f":"SP1_Sprint!H66","v":{"$error":"#VALUE!"}},{"$f":"SP1_Sprint!O66","v":""},{"$f":"SP1_Sprint!P66","v":""}]
[{"$f":"SP1_Sprint!G67","v":"00:00:07,76"},{"$f":"SP1_Sprint!H67","v":"00:00:00.760"},{"$f":"SP1_Sprint!O67","v":"Fahrer Peter Bel mit der StartNr. 66 ,hat erfolgreich die Prüfung SP1 absolviert. Zeit:   "},{"$f":"SP1_Sprint!P67","v":"00:00:00.760"}]
[{"$f":"SP1_Sprint!G68","v":"00:00:07,59"},{"$f":"SP1_Sprint!H68","v":"00:00:00.590"},{"$f":"SP1_Sprint!O68","v":"Fahrer Thomas Mirau mit der StartNr. 67 ,hat erfolgreich die Prüfung SP1 absolviert. Zeit:   "},{"$f":"SP1_Sprint!P68","v":"00:00:00.590"}]
[{"$f":"SP1_Sprint!G69","v":"00:00:08,44"},{"$f":"SP1_Sprint!H69","v":"00:00:01.440"},{"$f":"SP1_Sprint!O69","v":"Fahrer Markus Gotta mit der StartNr. 68 ,hat erfolgreich die Prüfung SP1 absolviert. Zeit:   "},{"$f":"SP1_Sprint!P69","v":"00:00:01.440"}]
[{"$f":"SP1_Sprint!G70","v":"00:00:08,11"},{"$f":"SP1_Sprint!H70","v":"00:00:01.110"},{"$f":"SP1_Sprint!O70","v":"Fahrer Robin Keulertz mit der StartNr. 69 ,hat erfolgreich die Prüfung SP1 absolviert. Zeit:   "},{"$f":"SP1_Sprint!P70","v":"00:00:01.110"}]
[{"$f":"SP1_Sprint!G71","v":"00:00:08,75"},{"$f":"SP1_Sprint!H71","v":"00:00:01.750"},{"$f":"SP1_Sprint!O71","v":"Fahrer Christian Häp mit der StartNr. 70 ,hat erfolgreich die Prüfung SP1 absolviert. Zeit:   "},{"$f":"SP1_Sprint!P71","v":"00:00:01.750"}]
[{"$f":"SP1_Sprint!G72","v":"00:00:07,96"},{"$f":"SP1_Sprint!H72","v":"00:00:00.960"},{"$f":"SP1_Sprint!O72","v":"Fahrer Ingolf Zschockelt mit der StartNr. 71 ,hat erfolgreich die Prüfung SP1 absolviert. Zeit:   "},{"$f":"SP1_Sprint!P72","v":"00:00:00.960"}]
[{"$f":"SP1_Sprint!G73","v":"00:00:08,12"},{"$f":"SP1_Sprint!H73","v":"00:00:01.120"},{"$f":"SP1_Sprint!O73","v":"Fahrer Michael Barsties mit der StartNr. 72 ,hat erfolgreich die Prüfung SP1 absolviert. Zeit:   "},{"$f":"SP1_Sprint!P73","v":"00:00:01.120"}]
[{"$f":"SP1_Sprint!G74","v":"00:00:07,75"},{"$f":"SP1_Sprint!H74","v":"00:00:00.750"},{"$f":"SP1_Sprint!O74","v":"Fahrer Ramona Wagner mit der StartNr. 73 ,hat erfolgreich die Prüfung SP1 absolviert. Zeit:   "},{"$f":"SP1_Sprint!P74","v":"00:00:00.750"}]
[{"$f":"SP1_Sprint!G75","v":"00:00:10,61"},{"$f":"SP1_Sprint!H75","v":"00:00:03.610"},{"$f":"SP1_Sprint!O75","v":"Fahrer Lars Fahrenbach mit der StartNr. 74 ,hat erfolgreich die Prüfung SP1 absolviert. Zeit:   "},{"$f":"SP1_Sprint!P75","v":"00:00:03.610"}]
[{"$f":"SP1_Sprint!G76","v":"00:00:06,13"},{"$f":"SP1_Sprint!H76","v":"00:00:00.870"},{"$f":"SP1_Sprint!O76","v":"Fahrer Frank Hoefnagels mit der StartNr. 75 ,hat erfolgreich die Prüfung SP1 absolviert. Zeit:   "},{"$f":"SP1_Sprint!P76","v":"00:00:00.870"}]
[{"$f":"SP1_Sprint!G77","v":"00:00:08,50"},{"$f":"SP1_Sprint!H77","v":"00:00:01.500"},{"$f":"SP1_Sprint!O77","v":"Fahrer Michael Karch mit der StartNr. 76 ,hat erfolgreich die Prüfung SP1 absolviert. Zeit:   "},{"$f":"SP1_Sprint!P77","v":"00:00:01.500"}]
[{"$f":"SP1_Sprint!G78","v":"00:00:06,96"},{"$f":"SP1_Sprint!H78","v":"00:00:00.040"},{"$f":"SP1_Sprint!O78","v":"Fahrer Dirk Götze mit der StartNr. 77 ,hat erfolgreich die Prüfung SP1 absolviert. Zeit:   "},{"$f":"SP1_Sprint!P78","v":"00:00:00.040"}]
[{"$f":"SP1_Sprint!G79","v":"00:00:09,28"},{"$f":"SP1_Sprint!H79","v":"00:00:02.280"},{"$f":"SP1_Sprint!O79","v":"Fahrer Stefan Hillers mit der StartNr. 78 ,hat erfolgreich die Prüfung SP1 absolviert. Zeit:   "},{"$f":"SP1_Sprint!P79","v":"00:00:02.280"}]
[{"$f":"SP1_Sprint!G80","v":"00:00:07,94"},{"$f":"SP1_Sprint!H80","v":"00:00:00.940"},{"$f":"SP1_Sprint!O80","v":"Fahrer Christian Rafflenbeul mit der StartNr. 79 ,hat erfolgreich die Prüfung SP1 absolviert. Zeit:   "},{"$f":"SP1_Sprint!P80","v":"00:00:00.940"}]
[{"$f":"SP1_Sprint!G81","v":"00:00:07,50"},{"$f":"SP1_Sprint!H81","v":"00:00:00.500"},{"$f":"SP1_Sprint!O81","v":"Fahrer Gerhard Reuschel mit der StartNr. 80 ,hat erfolgreich die Prüfung SP1 absolviert. Zeit:   "},{"$f":"SP1_Sprint!P81","v":"00:00:00.500"}]
[{"$f":"SP1_Sprint!G82","v":"00:00:11,57"},{"$f":"SP1_Sprint!H82","v":"00:00:04.570"},{"$f":"SP1_Sprint!O82","v":"Fahrer Karsten Rachow mit der StartNr. 81 ,hat erfolgreich die Prüfung SP1 absolviert. Zeit:   "},{"$f":"SP1_Sprint!P82","v":"00:00:04.570"}]
[{"$f":"SP1_Sprint!G83","v":"00:00:07,97"},{"$f":"SP1_Sprint!H83","v":"00:00:00.970"},{"$f":"SP1_Sprint!O83","v":"Fahrer Jürgen Ziller mit der StartNr. 82 ,hat erfolgreich die Prüfung SP1 absolviert. Zeit:   "},{"$f":"SP1_Sprint!P83","v":"00:00:00.970"}]
[{"$f":"SP1_Sprint!G84","v":"00:00:07,88"},{"$f":"SP1_Sprint!H84","v":"00:00:00.880"},{"$f":"SP1_Sprint!O84","v":"Fahrer Alexander Weil mit der StartNr. 83 ,hat erfolgreich die Prüfung SP1 absolviert. Zeit:   "},{"$f":"SP1_Sprint!P84","v":"00:00:00.880"}]
[{"$f":"SP1_Sprint!G85","v":"00:00:10,27"},{"$f":"SP1_Sprint!H85","v":"00:00:03.270"},{"$f":"SP1_Sprint!O85","v":"Fahrer Josef Lindenberger mit der StartNr. 84 ,hat erfolgreich die Prüfung SP1 absolviert. Zeit:   "},{"$f":"SP1_Sprint!P85","v":"00:00:03.270"}]
[{"$f":"SP1_Sprint!G86","v":"00:00:09,94"},{"$f":"SP1_Sprint!H86","v":"00:00:02.940"},{"$f":"SP1_Sprint!O86","v":"Fahrer Rick Durante mit der StartNr. 85 ,hat erfolgreich die Prüfung SP1 absolviert. Zeit:   "},{"$f":"SP1_Sprint!P86","v":"00:00:02.940"}]
[{"$f":"SP1_Sprint!G87","v":"00:00:09,96"},{"$f":"SP1_Sprint!H87","v":"00:00:02.960"},{"$f":"SP1_Sprint!O87","v":"Fahrer Almuth Siemann mit der StartNr. 86 ,hat erfolgreich die Prüfung SP1 absolviert. Zeit:   "},{"$f":"SP1_Sprint!P87","v":"00:00:02.960"}]
[{"$f":"SP1_Sprint!G88","v":"00:00:11,78"},{"$f":"SP1_Sprint!H88","v":"00:00:04.780"},{"$f":"SP1_Sprint!O88","v":"Fahrer Axel Strigl mit der StartNr. 87 ,hat erfolgreich die Prüfung SP1 absolviert. Zeit:   "},{"$f":"SP1_Sprint!P88","v":"00:00:04.780"}]
[{"$f":"SP1_Sprint!G89","v":"00:00:07,46"},{"$f":"SP1_Sprint!H89","v":"00:00:00.460"},{"$f":"SP1_Sprint!O89","v":"Fahrer Philip Sommer mit der StartNr. 88 ,hat erfolgreich die Prüfung SP1 absolviert. Zeit:   "},{"$f":"SP1_Sprint!P89","v":"00:00:00.460"}]
[{"$f":"SP1_Sprint!G90","v":"00:00:07,89"},{"$f":"SP1_Sprint!H90","v":"00:00:00.890"},{"$f":"SP1_Sprint!O90","v":"Fahrer Jörg Diehl mit der StartNr. 89 ,hat erfolgreich die Prüfung SP1 absolviert. Zeit:   "},{"$f":"SP1_Sprint!P90","v":"00:00:00.890"}]
[{"$f":"SP1_Sprint!G91","v":"00:00:08,35"},{"$f":"SP1_Sprint!H91","v":"00:00:01.350"},{"$f":"SP1_Sprint!O91","v":"Fahrer Matthias Herzig mit der StartNr. 90 ,hat erfolgreich die Prüfung SP1 absolviert. Zeit:   "},{"$f":"SP1_Sprint!P91","v":"00:00:01.350"}]
[{"$f":"SP1_Sprint!G92","v":"00:00:06,31"},{"$f":"SP1_Sprint!H92","v":"00:00:00.690"},{"$f":"SP1_Sprint!O92","v":"Fahrer Christoph Pasternak mit der StartNr. 91 ,hat erfolgreich die Prüfung SP1 absolviert. Zeit:   "},{"$f":"SP1_Sprint!P92","v":"00:00:00.690"}]
[{"$f":"SP1_Sprint!G93","v":"00:00:07,06"},{"$f":"SP1_Sprint!H93","v":"00:00:00.060"},{"$f":"SP1_Sprint!O93","v":"Fahrer Lothar Schupet mit der StartNr. 92 ,hat erfolgreich die Prüfung SP1 absolviert. Zeit:   "},{"$f":"SP1_Sprint!P93","v":"00:00:00.060"}]
[{"$f":"SP1_Sprint!G94","v":"00:00:07,82"},{"$f":"SP1_Sprint!H94","v":"00:00:00.820"},{"$f":"SP1_Sprint!O94","v":"Fahrer Wolfgang Schertler mit der StartNr. 93 ,hat erfolgreich die Prüfung SP1 absolviert. Zeit:   "},{"$f":"SP1_Sprint!P94","v":"00:00:00.820"}]
[{"$f":"SP1_Sprint!G95","v":"00:00:08,16"},{"$f":"SP1_Sprint!H95","v":"00:00:01.160"},{"$f":"SP1_Sprint!O95","v":"Fahrer Thomas Katzensteiner mit der StartNr. 94 ,hat erfolgreich die Prüfung SP1 absolviert. Zeit:   "},{"$f":"SP1_Sprint!P95","v":"00:00:01.160"}]
[{"$f":"SP1_Sprint!G96","v":"00:00:07,24"},{"$f":"SP1_Sprint!H96","v":"00:00:00.240"},{"$f":"SP1_Sprint!O96","v":"Fahrer Hagen Hackenberg mit der StartNr. 95 ,hat erfolgreich die Prüfung SP1 absolviert. Zeit:   "},{"$f":"SP1_Sprint!P96","v":"00:00:00.240"}]
[{"$f":"SP1_Sprint!G97","v":"00:00:07,06"},{"$f":"SP1_Sprint!H97","v":"00:00:00.060"},{"$f":"SP1_Sprint!O97","v":"Fahrer Oliver Dietz mit der StartNr. 96 ,hat erfolgreich die Prüfung SP1 absolviert. Zeit:   "},{"$f":"SP1_Sprint!P97","v":"00:00:00.060"}]
[{"$f":"SP1_Sprint!G98","v":"00:00:07,76"},{"$f":"SP1_Sprint!H98","v":"00:00:00.760"},{"$f":"SP1_Sprint!O98","v":"Fahrer Horst Kempf mit der StartNr. 97 ,hat erfolgreich die Prüfung SP1 absolviert. Zeit:   "},{"$f":"SP1_Sprint!P98","v":"00:00:00.760"}]
[{"$f":"SP1_Sprint!G99","v":"00:00:11,23"},{"$f":"SP1_Sprint!H99","v":"00:00:04.230"},{"$f":"SP1_Sprint!O99","v":"Fahrer Detlev Pauer mit der StartNr. 98 ,hat erfolgreich die Prüfung SP1 absolviert. Zeit:   "},{"$f":"SP1_Sprint!P99","v":"00:00:04.230"}]
[{"$f":"SP1_Sprint!G100","v":"00:00:07,69"},{"$f":"SP1_Sprint!H100","v":"00:00:00.690"},{"$f":"SP1_Sprint!O100","v":"Fahrer Dirk Velte mit der StartNr. 99 ,hat erfolgreich die Prüfung SP1 absolviert. Zeit:   "},{"$f":"SP1_Sprint!P100","v":"00:00:00.690"}]
[{"$f":"SP1_Sprint!G101","v":"00:00:07,11"},{"$f":"SP1_Sprint!H101","v":"00:00:00.110"},{"$f":"SP1_Sprint!O101","v":"Fahrer Thorsten Krack mit der StartNr. 100 ,hat erfolgreich die Prüfung SP1 absolviert. Zeit:   "},{"$f":"SP1_Sprint!P101","v":"00:00:00.110"}]
[{"$f":"SP1_Sprint!G102","v":"00:00:07,14"},{"$f":"SP1_Sprint!H102","v":"00:00:00.140"},{"$f":"SP1_Sprint!O102","v":"Fahrer Christian Wittek mit der StartNr. 101 ,hat erfolgreich die Prüfung SP1 absolviert. Zeit:   "},{"$f":"SP1_Sprint!P102","v":"00:00:00.140"}]
[{"$f":"SP1_Sprint!G103","v":"00:00:08,19"},{"$f":"SP1_Sprint!H103","v":"00:00:01.190"},{"$f":"SP1_Sprint!O103","v":"Fahrer Benjamin Hix mit der StartNr. 102 ,hat erfolgreich die Prüfung SP1 absolviert. Zeit:   "},{"$f":"SP1_Sprint!P103","v":"00:00:01.190"}]

{"sheet":"Export_SP2","index":9,"n_rows":102,"n_cols":4,"rows_kept":102,"cut":false,"hidden":false,"merged":[]}
[{"$f":"SP2_Sprint!G2","v":"00:00:08.080"},{"$f":"SP2_Sprint!H2","v":"00:00:00.080"},{"$f":"SP2_Sprint!O2","v":"Fahrer Christian Jäger mit der StartNr. 1 ,hat erfolgreich die Prüfung SP2 absolviert. Zeit: "},{"$f":"SP2_Sprint!P2","v":"00:00:00.080"}]
[{"$f":"SP2_Sprint!G3","v":"00:00:09.540"},{"$f":"SP2_Sprint!H3","v":"00:00:01.540"},{"$f":"SP2_Sprint!O3","v":"Fahrer Daniel Rinck mit der StartNr. 2 ,hat erfolgreich die Prüfung SP2 absolviert. Zeit: "},{"$f":"SP2_Sprint!P3","v":"00:00:01.540"}]
[{"$f":"SP2_Sprint!G4","v":"00:00:08.440"},{"$f":"SP2_Sprint!H4","v":"00:00:00.440"},{"$f":"SP2_Sprint!O4","v":"Fahrer Malte Proff-Klein mit der StartNr. 3 ,hat erfolgreich die Prüfung SP2 absolviert. Zeit: "},{"$f":"SP2_Sprint!P4","v":"00:00:00.440"}]
[{"$f":"SP2_Sprint!G5","v":"00:00:08.550"},{"$f":"SP2_Sprint!H5","v":"00:00:00.550"},{"$f":"SP2_Sprint!O5","v":"Fahrer Dietmar Siemssen mit der StartNr. 4 ,hat erfolgreich die Prüfung SP2 absolviert. Zeit: "},{"$f":"SP2_Sprint!P5","v":"00:00:00.550"}]
[{"$f":"SP2_Sprint!G6","v":"00:00:08.830"},{"$f":"SP2_Sprint!H6","v":"00:00:00.830"},{"$f":"SP2_Sprint!O6","v":"Fahrer Franz-Michael Hartmann mit der StartNr. 5 ,hat erfolgreich die Prüfung SP2 absolviert. Zeit: "},{"$f":"SP2_Sprint!P6","v":"00:00:00.830"}]
[{"$f":"SP2_Sprint!G7","v":"00:00:07.740"},{"$f":"SP2_Sprint!H7","v":"00:00:00.260"},{"$f":"SP2_Sprint!O7","v":"Fahrer Christoph Schroer mit der StartNr. 6 ,hat erfolgreich die Prüfung SP2 absolviert. Zeit: -"},{"$f":"SP2_Sprint!P7","v":"00:00:00.260"}]
[{"$f":"SP2_Sprint!G8","v":"00:00:08.180"},{"$f":"SP2_Sprint!H8","v":"00:00:00.180"},{"$f":"SP2_Sprint!O8","v":"Fahrer Jochen Artzinger-Bolten mit der StartNr. 7 ,hat erfolgreich die Prüfung SP2 absolviert. Zeit: "},{"$f":"SP2_Sprint!P8","v":"00:00:00.180"}]
[{"$f":"SP2_Sprint!G9","v":"00:00:09.270"},{"$f":"SP2_Sprint!H9","v":"00:00:01.270"},{"$f":"SP2_Sprint!O9","v":"Fahrer Friedhelm Eickhorn mit der StartNr. 8 ,hat erfolgreich die Prüfung SP2 absolviert. Zeit: "},{"$f":"SP2_Sprint!P9","v":"00:00:01.270"}]
[{"$f":"SP2_Sprint!G10","v":"00:00:08.910"},{"$f":"SP2_Sprint!H10","v":"00:00:00.910"},{"$f":"SP2_Sprint!O10","v":"Fahrer Carsten Reblin mit der StartNr. 9 ,hat erfolgreich die Prüfung SP2 absolviert. Zeit: "},{"$f":"SP2_Sprint!P10","v":"00:00:00.910"}]
[{"$f":"SP2_Sprint!G11","v":"00:00:08.620"},{"$f":"SP2_Sprint!H11","v":"00:00:00.620"},{"$f":"SP2_Sprint!O11","v":"Fahrer Dieter Dinges mit der StartNr. 10 ,hat erfolgreich die Prüfung SP2 absolviert. Zeit: "},{"$f":"SP2_Sprint!P11","v":"00:00:00.620"}]
[{"$f":"SP2_Sprint!G12","v":"00:00:09.220"},{"$f":"SP2_Sprint!H12","v":"00:00:01.220"},{"$f":"SP2_Sprint!O12","v":"Fahrer Wolfgang Reeh mit der StartNr. 11 ,hat erfolgreich die Prüfung SP2 absolviert. Zeit: "},{"$f":"SP2_Sprint!P12","v":"00:00:01.220"}]
[{"$f":"SP2_Sprint!G13","v":"00:00:08.520"},{"$f":"SP2_Sprint!H13","v":"00:00:00.520"},{"$f":"SP2_Sprint!O13","v":"Fahrer Andreas Petry mit der StartNr. 12 ,hat erfolgreich die Prüfung SP2 absolviert. Zeit: "},{"$f":"SP2_Sprint!P13","v":"00:00:00.520"}]
[{"$f":"SP2_Sprint!G14","v":"00:00:07.830"},{"$f":"SP2_Sprint!H14","v":"00:00:00.170"},{"$f":"SP2_Sprint!O14","v":"Fahrer Ted Prenzel mit der StartNr. 13 ,hat erfolgreich die Prüfung SP2 absolviert. Zeit: -"},{"$f":"SP2_Sprint!P14","v":"00:00:00.170"}]
[{"$f":"SP2_Sprint!G15","v":"00:00:10.390"},{"$f":"SP2_Sprint!H15","v":"00:00:02.390"},{"$f":"SP2_Sprint!O15","v":"Fahrer Micha Barsties mit der StartNr. 14 ,hat erfolgreich die Prüfung SP2 absolviert. Zeit: "},{"$f":"SP2_Sprint!P15","v":"00:00:02.390"}]
[{"$f":"SP2_Sprint!G16","v":"00:00:08.410"},{"$f":"SP2_Sprint!H16","v":"00:00:00.410"},{"$f":"SP2_Sprint!O16","v":"Fahrer Klaus Flettner mit der StartNr. 15 ,hat erfolgreich die Prüfung SP2 absolviert. Zeit: "},{"$f":"SP2_Sprint!P16","v":"00:00:00.410"}]
[{"$f":"SP2_Sprint!G17","v":"00:00:08.730"},{"$f":"SP2_Sprint!H17","v":"00:00:00.730"},{"$f":"SP2_Sprint!O17","v":"Fahrer Heinz Frey mit der StartNr. 16 ,hat erfolgreich die Prüfung SP2 absolviert. Zeit: "},{"$f":"SP2_Sprint!P17","v":"00:00:00.730"}]
[{"$f":"SP2_Sprint!G18","v":"00:00:08.590"},{"$f":"SP2_Sprint!H18","v":"00:00:00.590"},{"$f":"SP2_Sprint!O18","v":"Fahrer Henning Reichel mit der StartNr. 17 ,hat erfolgreich die Prüfung SP2 absolviert. Zeit: "},{"$f":"SP2_Sprint!P18","v":"00:00:00.590"}]
[{"$f":"SP2_Sprint!G19","v":"00:00:08.770"},{"$f":"SP2_Sprint!H19","v":"00:00:00.770"},{"$f":"SP2_Sprint!O19","v":"Fahrer Maik Käbisch mit der StartNr. 18 ,hat erfolgreich die Prüfung SP2 absolviert. Zeit: "},{"$f":"SP2_Sprint!P19","v":"00:00:00.770"}]
[{"$f":"SP2_Sprint!G20","v":"00:00:07.680"},{"$f":"SP2_Sprint!H20","v":"00:00:00.320"},{"$f":"SP2_Sprint!O20","v":"Fahrer Harald Zapp mit der StartNr. 19 ,hat erfolgreich die Prüfung SP2 absolviert. Zeit: -"},{"$f":"SP2_Sprint!P20","v":"00:00:00.320"}]
[{"$f":"SP2_Sprint!G21","v":"00:00:09.270"},{"$f":"SP2_Sprint!H21","v":"00:00:01.270"},{"$f":"SP2_Sprint!O21","v":"Fahrer Reinhard Grzesik mit der StartNr. 20 ,hat erfolgreich die Prüfung SP2 absolviert. Zeit: "},{"$f":"SP2_Sprint!P21","v":"00:00:01.270"}]
[{"$f":"SP2_Sprint!G22","v":"00:00:08.650"},{"$f":"SP2_Sprint!H22","v":"00:00:00.650"},{"$f":"SP2_Sprint!O22","v":"Fahrer Jörg Sihler mit der StartNr. 21 ,hat erfolgreich die Prüfung SP2 absolviert. Zeit: "},{"$f":"SP2_Sprint!P22","v":"00:00:00.650"}]
[{"$f":"SP2_Sprint!G23","v":"00:00:08.230"},{"$f":"SP2_Sprint!H23","v":"00:00:00.230"},{"$f":"SP2_Sprint!O23","v":"Fahrer Ingo Winterstein mit der StartNr. 22 ,hat erfolgreich die Prüfung SP2 absolviert. Zeit: "},{"$f":"SP2_Sprint!P23","v":"00:00:00.230"}]
[{"$f":"SP2_Sprint!G24","v":"00:00:09.290"},{"$f":"SP2_Sprint!H24","v":"00:00:01.290"},{"$f":"SP2_Sprint!O24","v":"Fahrer Hans Werner Melchior mit der StartNr. 23 ,hat erfolgreich die Prüfung SP2 absolviert. Zeit: "},{"$f":"SP2_Sprint!P24","v":"00:00:01.290"}]
[{"$f":"SP2_Sprint!G25","v":"00:00:07.710"},{"$f":"SP2_Sprint!H25","v":"00:00:00.290"},{"$f":"SP2_Sprint!O25","v":"Fahrer Marco Oriolo mit der StartNr. 24 ,hat erfolgreich die Prüfung SP2 absolviert. Zeit: -"},{"$f":"SP2_Sprint!P25","v":"00:00:00.290"}]
[{"$f":"SP2_Sprint!G26","v":"00:00:10.100"},{"$f":"SP2_Sprint!H26","v":"00:00:02.100"},{"$f":"SP2_Sprint!O26","v":"Fahrer Manfred Stommel mit der StartNr. 25 ,hat erfolgreich die Prüfung SP2 absolviert. Zeit: "},{"$f":"SP2_Sprint!P26","v":"00:00:02.100"}]
[{"$f":"SP2_Sprint!G27","v":"00:00:08.280"},{"$f":"SP2_Sprint!H27","v":"00:00:00.280"},{"$f":"SP2_Sprint!O27","v":"Fahrer Carolin Heusel mit der StartNr. 26 ,hat erfolgreich die Prüfung SP2 absolviert. Zeit: "},{"$f":"SP2_Sprint!P27","v":"00:00:00.280"}]
[{"$f":"SP2_Sprint!G28","v":"00:00:08.950"},{"$f":"SP2_Sprint!H28","v":"00:00:00.950"},{"$f":"SP2_Sprint!O28","v":"Fahrer Regina Philippi mit der StartNr. 27 ,hat erfolgreich die Prüfung SP2 absolviert. Zeit: "},{"$f":"SP2_Sprint!P28","v":"00:00:00.950"}]
[{"$f":"SP2_Sprint!G29","v":"00:00:09.490"},{"$f":"SP2_Sprint!H29","v":"00:00:01.490"},{"$f":"SP2_Sprint!O29","v":"Fahrer Christof Aha mit der StartNr. 28 ,hat erfolgreich die Prüfung SP2 absolviert. Zeit: "},{"$f":"SP2_Sprint!P29","v":"00:00:01.490"}]
[{"$f":"SP2_Sprint!G30","v":"00:00:09.420"},{"$f":"SP2_Sprint!H30","v":"00:00:01.420"},{"$f":"SP2_Sprint!O30","v":"Fahrer Dennis Weiss mit der StartNr. 29 ,hat erfolgreich die Prüfung SP2 absolviert. Zeit: "},{"$f":"SP2_Sprint!P30","v":"00:00:01.420"}]
[{"$f":"SP2_Sprint!G31","v":"00:00:08.010"},{"$f":"SP2_Sprint!H31","v":"00:00:00.010"},{"$f":"SP2_Sprint!O31","v":"Fahrer Harald Hamprecht mit der StartNr. 30 ,hat erfolgreich die Prüfung SP2 absolviert. Zeit: "},{"$f":"SP2_Sprint!P31","v":"00:00:00.010"}]
[{"$f":"SP2_Sprint!G32","v":"00:00:12.120"},{"$f":"SP2_Sprint!H32","v":"00:00:04.120"},{"$f":"SP2_Sprint!O32","v":"Fahrer Reno Fiolic mit der StartNr. 31 ,hat erfolgreich die Prüfung SP2 absolviert. Zeit: "},{"$f":"SP2_Sprint!P32","v":"00:00:04.120"}]
[{"$f":"SP2_Sprint!G33","v":"00:00:08.960"},{"$f":"SP2_Sprint!H33","v":"00:00:00.960"},{"$f":"SP2_Sprint!O33","v":"Fahrer Jürgen Kulpe mit der StartNr. 32 ,hat erfolgreich die Prüfung SP2 absolviert. Zeit: "},{"$f":"SP2_Sprint!P33","v":"00:00:00.960"}]
[{"$f":"SP2_Sprint!G34","v":"00:00:08.600"},{"$f":"SP2_Sprint!H34","v":"00:00:00.600"},{"$f":"SP2_Sprint!O34","v":"Fahrer Konstantin Kovarbasic mit der StartNr. 33 ,hat erfolgreich die Prüfung SP2 absolviert. Zeit: "},{"$f":"SP2_Sprint!P34","v":"00:00:00.600"}]
[{"$f":"SP2_Sprint!G35","v":"00:00:09.220"},{"$f":"SP2_Sprint!H35","v":"00:00:01.220"},{"$f":"SP2_Sprint!O35","v":"Fahrer Nikolaus Kratz mit der StartNr. 34 ,hat erfolgreich die Prüfung SP2 absolviert. Zeit: "},{"$f":"SP2_Sprint!P35","v":"00:00:01.220"}]
[{"$f":"SP2_Sprint!G36","v":"00:00:10.210"},{"$f":"SP2_Sprint!H36","v":"00:00:02.210"},{"$f":"SP2_Sprint!O36","v":"Fahrer Andreas Eberhardt mit der StartNr. 35 ,hat erfolgreich die Prüfung SP2 absolviert. Zeit: "},{"$f":"SP2_Sprint!P36","v":"00:00:02.210"}]
[{"$f":"SP2_Sprint!G37","v":"00:00:08.900"},{"$f":"SP2_Sprint!H37","v":"00:00:00.900"},{"$f":"SP2_Sprint!O37","v":"Fahrer Gerhard Thomas mit der StartNr. 36 ,hat erfolgreich die Prüfung SP2 absolviert. Zeit: "},{"$f":"SP2_Sprint!P37","v":"00:00:00.900"}]
[{"$f":"SP2_Sprint!G38","v":"00:00:08.420"},{"$f":"SP2_Sprint!H38","v":"00:00:00.420"},{"$f":"SP2_Sprint!O38","v":"Fahrer Lotzi Kende mit der StartNr. 37 ,hat erfolgreich die Prüfung SP2 absolviert. Zeit: "},{"$f":"SP2_Sprint!P38","v":"00:00:00.420"}]
[{"$f":"SP2_Sprint!G39","v":"00:00:08.160"},{"$f":"SP2_Sprint!H39","v":"00:00:00.160"},{"$f":"SP2_Sprint!O39","v":"Fahrer Jockel Winkelhock mit der StartNr. 38 ,hat erfolgreich die Prüfung SP2 absolviert. Zeit: "},{"$f":"SP2_Sprint!P39","v":"00:00:00.160"}]
[{"$f":"SP2_Sprint!G40","v":"00:00:10.280"},{"$f":"SP2_Sprint!H40","v":"00:00:02.280"},{"$f":"SP2_Sprint!O40","v":"Fahrer Sascha Wilkesmann mit der StartNr. 39 ,hat erfolgreich die Prüfung SP2 absolviert. Zeit: "},{"$f":"SP2_Sprint!P40","v":"00:00:02.280"}]
[{"$f":"SP2_Sprint!G41","v":"00:00:10.790"},{"$f":"SP2_Sprint!H41","v":"00:00:02.790"},{"$f":"SP2_Sprint!O41","v":"Fahrer Gregor Schulz mit der StartNr. 40 ,hat erfolgreich die Prüfung SP2 absolviert. Zeit: "},{"$f":"SP2_Sprint!P41","v":"00:00:02.790"}]
[{"$f":"SP2_Sprint!G42","v":"00:00:07.740"},{"$f":"SP2_Sprint!H42","v":"00:00:00.260"},{"$f":"SP2_Sprint!O42","v":"Fahrer Peer Hildmann mit der StartNr. 41 ,hat erfolgreich die Prüfung SP2 absolviert. Zeit: -"},{"$f":"SP2_Sprint!P42","v":"00:00:00.260"}]
[{"$f":"SP2_Sprint!G43","v":"00:00:07.720"},{"$f":"SP2_Sprint!H43","v":"00:00:00.280"},{"$f":"SP2_Sprint!O43","v":"Fahrer Mina Tander mit der StartNr. 42 ,hat erfolgreich die Prüfung SP2 absolviert. Zeit: -"},{"$f":"SP2_Sprint!P43","v":"00:00:00.280"}]
[{"$f":"SP2_Sprint!G44","v":"00:00:08.380"},{"$f":"SP2_Sprint!H44","v":"00:00:00.380"},{"$f":"SP2_Sprint!O44","v":"Fahrer Stefan Iskan mit der StartNr. 43 ,hat erfolgreich die Prüfung SP2 absolviert. Zeit: "},{"$f":"SP2_Sprint!P44","v":"00:00:00.380"}]
[{"$f":"SP2_Sprint!G45","v":"00:00:09.310"},{"$f":"SP2_Sprint!H45","v":"00:00:01.310"},{"$f":"SP2_Sprint!O45","v":"Fahrer Jean-Philippe Kempf mit der StartNr. 44 ,hat erfolgreich die Prüfung SP2 absolviert. Zeit: "},{"$f":"SP2_Sprint!P45","v":"00:00:01.310"}]
[{"$f":"SP2_Sprint!G46","v":"00:00:08.720"},{"$f":"SP2_Sprint!H46","v":"00:00:00.720"},{"$f":"SP2_Sprint!O46","v":"Fahrer Daniel Martin mit der StartNr. 45 ,hat erfolgreich die Prüfung SP2 absolviert. Zeit: "},{"$f":"SP2_Sprint!P46","v":"00:00:00.720"}]
[{"$f":"SP2_Sprint!G47","v":"00:00:09.100"},{"$f":"SP2_Sprint!H47","v":"00:00:01.100"},{"$f":"SP2_Sprint!O47","v":"Fahrer Elena Funk mit der StartNr. 46 ,hat erfolgreich die Prüfung SP2 absolviert. Zeit: "},{"$f":"SP2_Sprint!P47","v":"00:00:01.100"}]
[{"$f":"SP2_Sprint!G48","v":"00:00:07.780"},{"$f":"SP2_Sprint!H48","v":"00:00:00.220"},{"$f":"SP2_Sprint!O48","v":"Fahrer Hans Mutschall mit der StartNr. 47 ,hat erfolgreich die Prüfung SP2 absolviert. Zeit: -"},{"$f":"SP2_Sprint!P48","v":"00:00:00.220"}]
[{"$f":"SP2_Sprint!G49","v":"00:00:09.300"},{"$f":"SP2_Sprint!H49","v":"00:00:01.300"},{"$f":"SP2_Sprint!O49","v":"Fahrer Kahled Rahman mit der StartNr. 48 ,hat erfolgreich die Prüfung SP2 absolviert. Zeit: "},{"$f":"SP2_Sprint!P49","v":"00:00:01.300"}]
[{"$f":"SP2_Sprint!G50","v":"00:00:08.130"},{"$f":"SP2_Sprint!H50","v":"00:00:00.130"},{"$f":"SP2_Sprint!O50","v":"Fahrer Jochen Schwarz mit der StartNr. 49 ,hat erfolgreich die Prüfung SP2 absolviert. Zeit: "},{"$f":"SP2_Sprint!P50","v":"00:00:00.130"}]
[null,{"$f":"SP1_Sprint!H51","v":{"$error":"#VALUE!"}}]
[{"$f":"SP2_Sprint!G52","v":"00:00:09.220"},{"$f":"SP2_Sprint!H52","v":"00:00:01.220"},{"$f":"SP2_Sprint!O52","v":"Fahrer Birgit Claussen mit der StartNr. 51 ,hat erfolgreich die Prüfung SP2 absolviert. Zeit: "},{"$f":"SP2_Sprint!P52","v":"00:00:01.220"}]
[{"$f":"SP2_Sprint!G53","v":"00:00:09.060"},{"$f":"SP2_Sprint!H53","v":"00:00:01.060"},{"$f":"SP2_Sprint!O53","v":"Fahrer Harald König mit der StartNr. 52 ,hat erfolgreich die Prüfung SP2 absolviert. Zeit: "},{"$f":"SP2_Sprint!P53","v":"00:00:01.060"}]
[{"$f":"SP2_Sprint!G54","v":"00:00:09.670"},{"$f":"SP2_Sprint!H54","v":"00:00:01.670"},{"$f":"SP2_Sprint!O54","v":"Fahrer Thomas Blank mit der StartNr. 53 ,hat erfolgreich die Prüfung SP2 absolviert. Zeit: "},{"$f":"SP2_Sprint!P54","v":"00:00:01.670"}]
[{"$f":"SP2_Sprint!G55","v":"00:00:09.420"},{"$f":"SP2_Sprint!H55","v":"00:00:01.420"},{"$f":"SP2_Sprint!O55","v":"Fahrer Heidi Eberhardt mit der StartNr. 54 ,hat erfolgreich die Prüfung SP2 absolviert. Zeit: "},{"$f":"SP2_Sprint!P55","v":"00:00:01.420"}]
[{"$f":"SP2_Sprint!G56","v":"00:00:07.720"},{"$f":"SP2_Sprint!H56","v":"00:00:00.280"},{"$f":"SP2_Sprint!O56","v":"Fahrer Karina Ansos mit der StartNr. 55 ,hat erfolgreich die Prüfung SP2 absolviert. Zeit: -"},{"$f":"SP2_Sprint!P56","v":"00:00:00.280"}]
[{"$f":"SP2_Sprint!G57","v":"00:00:10.060"},{"$f":"SP2_Sprint!H57","v":"00:00:02.060"},{"$f":"SP2_Sprint!O57","v":"Fahrer Michael Gotta mit der StartNr. 56 ,hat erfolgreich die Prüfung SP2 absolviert. Zeit: "},{"$f":"SP2_Sprint!P57","v":"00:00:02.060"}]
[{"$f":"SP2_Sprint!G58","v":"00:00:08.990"},{"$f":"SP2_Sprint!H58","v":"00:00:00.990"},{"$f":"SP2_Sprint!O58","v":"Fahrer Stefanie Rinck mit der StartNr. 57 ,hat erfolgreich die Prüfung SP2 absolviert. Zeit: "},{"$f":"SP2_Sprint!P58","v":"00:00:00.990"}]
[{"$f":"SP2_Sprint!G59","v":"00:00:10.390"},{"$f":"SP2_Sprint!H59","v":"00:00:02.390"},{"$f":"SP2_Sprint!O59","v":"Fahrer Armin Slotta mit der StartNr. 58 ,hat erfolgreich die Prüfung SP2 absolviert. Zeit: "},{"$f":"SP2_Sprint!P59","v":"00:00:02.390"}]
[{"$f":"SP2_Sprint!G60","v":"00:00:08.530"},{"$f":"SP2_Sprint!H60","v":"00:00:00.530"},{"$f":"SP2_Sprint!O60","v":"Fahrer Julia Kende mit der StartNr. 59 ,hat erfolgreich die Prüfung SP2 absolviert. Zeit: "},{"$f":"SP2_Sprint!P60","v":"00:00:00.530"}]
[{"$f":"SP2_Sprint!G61","v":"00:00:08.550"},{"$f":"SP2_Sprint!H61","v":"00:00:00.550"},{"$f":"SP2_Sprint!O61","v":"Fahrer Robert Bleckmann mit der StartNr. 60 ,hat erfolgreich die Prüfung SP2 absolviert. Zeit: "},{"$f":"SP2_Sprint!P61","v":"00:00:00.550"}]
[{"$f":"SP2_Sprint!G62","v":"00:00:09.430"},{"$f":"SP2_Sprint!H62","v":"00:00:01.430"},{"$f":"SP2_Sprint!O62","v":"Fahrer Christof Harwardt mit der StartNr. 61 ,hat erfolgreich die Prüfung SP2 absolviert. Zeit: "},{"$f":"SP2_Sprint!P62","v":"00:00:01.430"}]
[{"$f":"SP2_Sprint!G63","v":"00:00:09.400"},{"$f":"SP2_Sprint!H63","v":"00:00:01.400"},{"$f":"SP2_Sprint!O63","v":"Fahrer Thomas Kahns mit der StartNr. 62 ,hat erfolgreich die Prüfung SP2 absolviert. Zeit: "},{"$f":"SP2_Sprint!P63","v":"00:00:01.400"}]
[{"$f":"SP2_Sprint!G64","v":"00:00:07.960"},{"$f":"SP2_Sprint!H64","v":"00:00:00.040"},{"$f":"SP2_Sprint!O64","v":"Fahrer Maximilian Herbst mit der StartNr. 63 ,hat erfolgreich die Prüfung SP2 absolviert. Zeit: -"},{"$f":"SP2_Sprint!P64","v":"00:00:00.040"}]
[{"$f":"SP2_Sprint!G65","v":"00:00:07.700"},{"$f":"SP2_Sprint!H65","v":"00:00:00.300"},{"$f":"SP2_Sprint!O65","v":"Fahrer Jürgen Buchhold mit der StartNr. 64 ,hat erfolgreich die Prüfung SP2 absolviert. Zeit: -"},{"$f":"SP2_Sprint!P65","v":"00:00:00.300"}]
[null,{"$f":"SP1_Sprint!H66","v":{"$error":"#VALUE!"}}]
[{"$f":"SP2_Sprint!G67","v":"00:00:07.200"},{"$f":"SP2_Sprint!H67","v":"00:00:00.800"},{"$f":"SP2_Sprint!O67","v":"Fahrer Peter Bel mit der StartNr. 66 ,hat erfolgreich die Prüfung SP2 absolviert. Zeit: -"},{"$f":"SP2_Sprint!P67","v":"00:00:00.800"}]
[{"$f":"SP2_Sprint!G68","v":"00:00:08.560"},{"$f":"SP2_Sprint!H68","v":"00:00:00.560"},{"$f":"SP2_Sprint!O68","v":"Fahrer Thomas Mirau mit der StartNr. 67 ,hat erfolgreich die Prüfung SP2 absolviert. Zeit: "},{"$f":"SP2_Sprint!P68","v":"00:00:00.560"}]
[{"$f":"SP2_Sprint!G69","v":"00:00:09.690"},{"$f":"SP2_Sprint!H69","v":"00:00:01.690"},{"$f":"SP2_Sprint!O69","v":"Fahrer Markus Gotta mit der StartNr. 68 ,hat erfolgreich die Prüfung SP2 absolviert. Zeit: "},{"$f":"SP2_Sprint!P69","v":"00:00:01.690"}]
[{"$f":"SP2_Sprint!G70","v":"00:00:07.660"},{"$f":"SP2_Sprint!H70","v":"00:00:00.340"},{"$f":"SP2_Sprint!O70","v":"Fahrer Robin Keulertz mit der StartNr. 69 ,hat erfolgreich die Prüfung SP2 absolviert. Zeit: -"},{"$f":"SP2_Sprint!P70","v":"00:00:00.340"}]
[{"$f":"SP2_Sprint!G71","v":"00:00:08.970"},{"$f":"SP2_Sprint!H71","v":"00:00:00.970"},{"$f":"SP2_Sprint!O71","v":"Fahrer Christian Häp mit der StartNr. 70 ,hat erfolgreich die Prüfung SP2 absolviert. Zeit: "},{"$f":"SP2_Sprint!P71","v":"00:00:00.970"}]
[{"$f":"SP2_Sprint!G72","v":"00:00:08.620"},{"$f":"SP2_Sprint!H72","v":"00:00:00.620"},{"$f":"SP2_Sprint!O72","v":"Fahrer Ingolf Zschockelt mit der StartNr. 71 ,hat erfolgreich die Prüfung SP2 absolviert. Zeit: "},{"$f":"SP2_Sprint!P72","v":"00:00:00.620"}]
[{"$f":"SP2_Sprint!G73","v":"00:00:10.490"},{"$f":"SP2_Sprint!H73","v":"00:00:02.490"},{"$f":"SP2_Sprint!O73","v":"Fahrer Michael Barsties mit der StartNr. 72 ,hat erfolgreich die Prüfung SP2 absolviert. Zeit: "},{"$f":"SP2_Sprint!P73","v":"00:00:02.490"}]
[{"$f":"SP2_Sprint!G74","v":"00:00:08.900"},{"$f":"SP2_Sprint!H74","v":"00:00:00.900"},{"$f":"SP2_Sprint!O74","v":"Fahrer Ramona Wagner mit der StartNr. 73 ,hat erfolgreich die Prüfung SP2 absolviert. Zeit: "},{"$f":"SP2_Sprint!P74","v":"00:00:00.900"}]
[{"$f":"SP2_Sprint!G75","v":"00:00:07.890"},{"$f":"SP2_Sprint!H75","v":"00:00:00.110"},{"$f":"SP2_Sprint!O75","v":"Fahrer Lars Fahrenbach mit der StartNr. 74 ,hat erfolgreich die Prüfung SP2 absolviert. Zeit: -"},{"$f":"SP2_Sprint!P75","v":"00:00:00.110"}]
[{"$f":"SP2_Sprint!G76","v":"00:00:08.110"},{"$f":"SP2_Sprint!H76","v":"00:00:00.110"},{"$f":"SP2_Sprint!O76","v":"Fahrer Frank Hoefnagels mit der StartNr. 75 ,hat erfolgreich die Prüfung SP2 absolviert. Zeit: "},{"$f":"SP2_Sprint!P76","v":"00:00:00.110"}]
[{"$f":"SP2_Sprint!G77","v":"00:00:08.580"},{"$f":"SP2_Sprint!H77","v":"00:00:00.580"},{"$f":"SP2_Sprint!O77","v":"Fahrer Michael Karch mit der StartNr. 76 ,hat erfolgreich die Prüfung SP2 absolviert. Zeit: "},{"$f":"SP2_Sprint!P77","v":"00:00:00.580"}]
[{"$f":"SP2_Sprint!G78","v":"00:00:08.920"},{"$f":"SP2_Sprint!H78","v":"00:00:00.920"},{"$f":"SP2_Sprint!O78","v":"Fahrer Dirk Götze mit der StartNr. 77 ,hat erfolgreich die Prüfung SP2 absolviert. Zeit: "},{"$f":"SP2_Sprint!P78","v":"00:00:00.920"}]
[{"$f":"SP2_Sprint!G79","v":"00:00:09.990"},{"$f":"SP2_Sprint!H79","v":"00:00:01.990"},{"$f":"SP2_Sprint!O79","v":"Fahrer Stefan Hillers mit der StartNr. 78 ,hat erfolgreich die Prüfung SP2 absolviert. Zeit: "},{"$f":"SP2_Sprint!P79","v":"00:00:01.990"}]
[{"$f":"SP2_Sprint!G80","v":"00:00:09.070"},{"$f":"SP2_Sprint!H80","v":"00:00:01.070"},{"$f":"SP2_Sprint!O80","v":"Fahrer Christian Rafflenbeul mit der StartNr. 79 ,hat erfolgreich die Prüfung SP2 absolviert. Zeit: "},{"$f":"SP2_Sprint!P80","v":"00:00:01.070"}]
[{"$f":"SP2_Sprint!G81","v":"00:00:09.460"},{"$f":"SP2_Sprint!H81","v":"00:00:01.460"},{"$f":"SP2_Sprint!O81","v":"Fahrer Gerhard Reuschel mit der StartNr. 80 ,hat erfolgreich die Prüfung SP2 absolviert. Zeit: "},{"$f":"SP2_Sprint!P81","v":"00:00:01.460"}]
[{"$f":"SP2_Sprint!G82","v":"00:00:07.710"},{"$f":"SP2_Sprint!H82","v":"00:00:00.290"},{"$f":"SP2_Sprint!O82","v":"Fahrer Karsten Rachow mit der StartNr. 81 ,hat erfolgreich die Prüfung SP2 absolviert. Zeit: -"},{"$f":"SP2_Sprint!P82","v":"00:00:00.290"}]
[null,{"$error":"#VALUE!"}]
[{"$f":"SP2_Sprint!G84","v":"00:00:10.320"},{"$f":"SP2_Sprint!H84","v":"00:00:02.320"},{"$f":"SP2_Sprint!O84","v":"Fahrer Alexander Weil mit der StartNr. 83 ,hat erfolgreich die Prüfung SP2 absolviert. Zeit: "},{"$f":"SP2_Sprint!P84","v":"00:00:02.320"}]
[{"$f":"SP2_Sprint!G85","v":"00:00:13.120"},{"$f":"SP2_Sprint!H85","v":"00:00:05.120"},{"$f":"SP2_Sprint!O85","v":"Fahrer Josef Lindenberger mit der StartNr. 84 ,hat erfolgreich die Prüfung SP2 absolviert. Zeit: "},{"$f":"SP2_Sprint!P85","v":"00:00:05.120"}]
[{"$f":"SP2_Sprint!G86","v":"00:00:08.740"},{"$f":"SP2_Sprint!H86","v":"00:00:00.740"},{"$f":"SP2_Sprint!O86","v":"Fahrer Rick Durante mit der StartNr. 85 ,hat erfolgreich die Prüfung SP2 absolviert. Zeit: "},{"$f":"SP2_Sprint!P86","v":"00:00:00.740"}]
[{"$f":"SP2_Sprint!G87","v":"00:00:09.650"},{"$f":"SP2_Sprint!H87","v":"00:00:01.650"},{"$f":"SP2_Sprint!O87","v":"Fahrer Almuth Siemann mit der StartNr. 86 ,hat erfolgreich die Prüfung SP2 absolviert. Zeit: "},{"$f":"SP2_Sprint!P87","v":"00:00:01.650"}]
[{"$f":"SP2_Sprint!G88","v":"00:00:14.750"},{"$f":"SP2_Sprint!H88","v":"00:00:06.750"},{"$f":"SP2_Sprint!O88","v":"Fahrer Axel Strigl mit der StartNr. 87 ,hat erfolgreich die Prüfung SP2 absolviert. Zeit: "},{"$f":"SP2_Sprint!P88","v":"00:00:06.750"}]
[{"$f":"SP2_Sprint!G89","v":"00:00:08.360"},{"$f":"SP2_Sprint!H89","v":"00:00:00.360"},{"$f":"SP2_Sprint!O89","v":"Fahrer Philip Sommer mit der StartNr. 88 ,hat erfolgreich die Prüfung SP2 absolviert. Zeit: "},{"$f":"SP2_Sprint!P89","v":"00:00:00.360"}]
[{"$f":"SP2_Sprint!G90","v":"00:00:09.020"},{"$f":"SP2_Sprint!H90","v":"00:00:01.020"},{"$f":"SP2_Sprint!O90","v":"Fahrer Jörg Diehl mit der StartNr. 89 ,hat erfolgreich die Prüfung SP2 absolviert. Zeit: "},{"$f":"SP2_Sprint!P90","v":"00:00:01.020"}]
[{"$f":"SP2_Sprint!G91","v":"00:00:09.470"},{"$f":"SP2_Sprint!H91","v":"00:00:01.470"},{"$f":"SP2_Sprint!O91","v":"Fahrer Matthias Herzig mit der StartNr. 90 ,hat erfolgreich die Prüfung SP2 absolviert. Zeit: "},{"$f":"SP2_Sprint!P91","v":"00:00:01.470"}]
[{"$f":"SP2_Sprint!G92","v":"00:00:09.620"},{"$f":"SP2_Sprint!H92","v":"00:00:01.620"},{"$f":"SP2_Sprint!O92","v":"Fahrer Christoph Pasternak mit der StartNr. 91 ,hat erfolgreich die Prüfung SP2 absolviert. Zeit: "},{"$f":"SP2_Sprint!P92","v":"00:00:01.620"}]
[{"$f":"SP2_Sprint!G93","v":"00:00:08.700"},{"$f":"SP2_Sprint!H93","v":"00:00:00.700"},{"$f":"SP2_Sprint!O93","v":"Fahrer Lothar Schupet mit der StartNr. 92 ,hat erfolgreich die Prüfung SP2 absolviert. Zeit: "},{"$f":"SP2_Sprint!P93","v":"00:00:00.700"}]
[{"$f":"SP2_Sprint!G94","v":"00:00:07.710"},{"$f":"SP2_Sprint!H94","v":"00:00:00.290"},{"$f":"SP2_Sprint!O94","v":"Fahrer Wolfgang Schertler mit der StartNr. 93 ,hat erfolgreich die Prüfung SP2 absolviert. Zeit: -"},{"$f":"SP2_Sprint!P94","v":"00:00:00.290"}]
[{"$f":"SP2_Sprint!G95","v":"00:00:09.560"},{"$f":"SP2_Sprint!H95","v":"00:00:01.560"},{"$f":"SP2_Sprint!O95","v":"Fahrer Thomas Katzensteiner mit der StartNr. 94 ,hat erfolgreich die Prüfung SP2 absolviert. Zeit: "},{"$f":"SP2_Sprint!P95","v":"00:00:01.560"}]
[{"$f":"SP2_Sprint!G96","v":"00:00:08.020"},{"$f":"SP2_Sprint!H96","v":"00:00:00.020"},{"$f":"SP2_Sprint!O96","v":"Fahrer Hagen Hackenberg mit der StartNr. 95 ,hat erfolgreich die Prüfung SP2 absolviert. Zeit: "},{"$f":"SP2_Sprint!P96","v":"00:00:00.020"}]
[{"$f":"SP2_Sprint!G97","v":"00:00:08.560"},{"$f":"SP2_Sprint!H97","v":"00:00:00.560"},{"$f":"SP2_Sprint!O97","v":"Fahrer Oliver Dietz mit der StartNr. 96 ,hat erfolgreich die Prüfung SP2 absolviert. Zeit: "},{"$f":"SP2_Sprint!P97","v":"00:00:00.560"}]
[{"$f":"SP2_Sprint!G98","v":"00:00:08.610"},{"$f":"SP2_Sprint!H98","v":"00:00:00.610"},{"$f":"SP2_Sprint!O98","v":"Fahrer Horst Kempf mit der StartNr. 97 ,hat erfolgreich die Prüfung SP2 absolviert. Zeit: "},{"$f":"SP2_Sprint!P98","v":"00:00:00.610"}]
[{"$f":"SP2_Sprint!G99","v":"00:00:10.300"},{"$f":"SP2_Sprint!H99","v":"00:00:02.300"},{"$f":"SP2_Sprint!O99","v":"Fahrer Detlev Pauer mit der StartNr. 98 ,hat erfolgreich die Prüfung SP2 absolviert. Zeit: "},{"$f":"SP2_Sprint!P99","v":"00:00:02.300"}]
[{"$f":"SP2_Sprint!G100","v":"00:00:08.300"},{"$f":"SP2_Sprint!H100","v":"00:00:00.300"},{"$f":"SP2_Sprint!O100","v":"Fahrer Dirk Velte mit der StartNr. 99 ,hat erfolgreich die Prüfung SP2 absolviert. Zeit: "},{"$f":"SP2_Sprint!P100","v":"00:00:00.300"}]
[{"$f":"SP2_Sprint!G101","v":"00:00:07.320"},{"$f":"SP2_Sprint!H101","v":"00:00:00.680"},{"$f":"SP2_Sprint!O101","v":"Fahrer Thorsten Krack mit der StartNr. 100 ,hat erfolgreich die Prüfung SP2 absolviert. Zeit: -"},{"$f":"SP2_Sprint!P101","v":"00:00:00.680"}]
[{"$f":"SP2_Sprint!G102","v":"00:00:08.480"},{"$f":"SP2_Sprint!H102","v":"00:00:00.480"},{"$f":"SP2_Sprint!O102","v":"Fahrer Christian Wittek mit der StartNr. 101 ,hat erfolgreich die Prüfung SP2 absolviert. Zeit: "},{"$f":"SP2_Sprint!P102","v":"00:00:00.480"}]
[{"$f":"SP2_Sprint!G103","v":"00:00:08.600"},{"$f":"SP2_Sprint!H103","v":"00:00:00.600"},{"$f":"SP2_Sprint!O103","v":"Fahrer Benjamin Hix mit der StartNr. 102 ,hat erfolgreich die Prüfung SP2 absolviert. Zeit: "},{"$f":"SP2_Sprint!P103","v":"00:00:00.600"}]

{"sheet":"Export_SP3","index":10,"n_rows":102,"n_cols":7,"rows_kept":102,"cut":false,"hidden":false,"merged":[]}
[{"$f":"'SP3'!I3","v":"14:50:00,00"},{"$f":"'SP3'!J3","v":"14:52:45,25"},{"$f":"'SP3'!K3","v":"00:02:45,25"},{"$f":"'SP3'!L3","v":"00:02:45.250"},{"$f":"'SP3'!M3","v":"00:00:00.250"},{"$f":"'SP3'!T3","v":"Fahrer Christian Jäger mit der StartNr. 1 ,hat erfolgreich die Prüfung SP3 absolviert. Zeit:   "},{"$f":"'SP3'!U3","v":"00:00:00.250"}]
[{"$f":"'SP3'!I4","v":"14:51:00,00"},{"$f":"'SP3'!J4","v":"14:53:45,51"},{"$f":"'SP3'!K4","v":"00:02:45,51"},{"$f":"'SP3'!L4","v":"00:02:45.510"},{"$f":"'SP3'!M4","v":"00:00:00.510"},{"$f":"'SP3'!T4","v":"Fahrer Daniel Rinck mit der StartNr. 2 ,hat erfolgreich die Prüfung SP3 absolviert. Zeit:   "},{"$f":"'SP3'!U4","v":"00:00:00.510"}]
[{"$f":"'SP3'!I5","v":"14:52:00,00"},{"$f":"'SP3'!J5","v":"14:54:45,34"},{"$f":"'SP3'!K5","v":"00:02:45,34"},{"$f":"'SP3'!L5","v":"00:02:45.340"},{"$f":"'SP3'!M5","v":"00:00:00.340"},{"$f":"'SP3'!T5","v":"Fahrer Malte Proff-Klein mit der StartNr. 3 ,hat erfolgreich die Prüfung SP3 absolviert. Zeit:   "},{"$f":"'SP3'!U5","v":"00:00:00.340"}]
[{"$f":"'SP3'!I6","v":"14:53:00,00"},{"$f":"'SP3'!J6","v":"14:55:46,02"},{"$f":"'SP3'!K6","v":"00:02:46,02"},{"$f":"'SP3'!L6","v":"00:02:46.020"},{"$f":"'SP3'!M6","v":"00:00:01.020"},{"$f":"'SP3'!T6","v":"Fahrer Dietmar Siemssen mit der StartNr. 4 ,hat erfolgreich die Prüfung SP3 absolviert. Zeit:   "},{"$f":"'SP3'!U6","v":"00:00:01.020"}]
[{"$f":"'SP3'!I7","v":"14:53:30,00"},{"$f":"'SP3'!J7","v":"14:55:59,78"},{"$f":"'SP3'!K7","v":"00:02:29,78"},{"$f":"'SP3'!L7","v":"00:02:29.780"},{"$f":"'SP3'!M7","v":"00:00:15.220"},{"$f":"'SP3'!T7","v":"Fahrer Franz-Michael Hartmann mit der StartNr. 5 ,hat erfolgreich die Prüfung SP3 absolviert. Zeit: -  "},{"$f":"'SP3'!U7","v":"00:00:15.220"}]
[{"$f":"'SP3'!I8","v":"14:54:30,00"},{"$f":"'SP3'!J8","v":"14:57:15,76"},{"$f":"'SP3'!K8","v":"00:02:45,76"},{"$f":"'SP3'!L8","v":"00:02:45.760"},{"$f":"'SP3'!M8","v":"00:00:00.760"},{"$f":"'SP3'!T8","v":"Fahrer Christoph Schroer mit der StartNr. 6 ,hat erfolgreich die Prüfung SP3 absolviert. Zeit:   "},{"$f":"'SP3'!U8","v":"00:00:00.760"}]
[{"$f":"'SP3'!I9","v":"14:55:00,00"},{"$f":"'SP3'!J9","v":"14:58:11,11"},{"$f":"'SP3'!K9","v":"00:03:11,11"},{"$f":"'SP3'!L9","v":"00:03:11.110"},{"$f":"'SP3'!M9","v":"00:00:26.110"},{"$f":"'SP3'!T9","v":"Fahrer Jochen Artzinger-Bolten mit der StartNr. 7 ,hat erfolgreich die Prüfung SP3 absolviert. Zeit:   "},{"$f":"'SP3'!U9","v":"00:00:26.110"}]
[{"$f":"'SP3'!I10","v":"14:55:30,00"},{"$f":"'SP3'!J10","v":"14:58:15,00"},{"$f":"'SP3'!K10","v":"00:02:45,00"},{"$f":"'SP3'!L10","v":"00:02:45"},{"$f":"'SP3'!M10","v":"00:00:00"},{"$f":"'SP3'!T10","v":"Fahrer Friedhelm Eickhorn mit der StartNr. 8 ,hat erfolgreich die Prüfung SP3 absolviert. Zeit: -  "},{"$f":"'SP3'!U10","v":"00:00:00"}]
[{"$f":"'SP3'!I11","v":"14:56:30,00"},{"$f":"'SP3'!J11","v":"14:59:15,97"},{"$f":"'SP3'!K11","v":"00:02:45,97"},{"$f":"'SP3'!L11","v":"00:02:45.970"},{"$f":"'SP3'!M11","v":"00:00:00.970"},{"$f":"'SP3'!T11","v":"Fahrer Carsten Reblin mit der StartNr. 9 ,hat erfolgreich die Prüfung SP3 absolviert. Zeit:   "},{"$f":"'SP3'!U11","v":"00:00:00.970"}]
[{"$f":"'SP3'!I12","v":"14:57:00,00"},{"$f":"'SP3'!J12","v":"14:59:37,70"},{"$f":"'SP3'!K12","v":"00:02:37,70"},{"$f":"'SP3'!L12","v":"00:02:37.700"},{"$f":"'SP3'!M12","v":"00:00:07.300"},{"$f":"'SP3'!T12","v":"Fahrer Dieter Dinges mit der StartNr. 10 ,hat erfolgreich die Prüfung SP3 absolviert. Zeit: -  "},{"$f":"'SP3'!U12","v":"00:00:07.300"}]
[{"$f":"'SP3'!I13","v":"14:58:00,00"},{"$f":"'SP3'!J13","v":"15:00:43,78"},{"$f":"'SP3'!K13","v":"00:02:43,78"},{"$f":"'SP3'!L13","v":"00:02:43.780"},{"$f":"'SP3'!M13","v":"00:00:01.220"},{"$f":"'SP3'!T13","v":"Fahrer Wolfgang Reeh mit der StartNr. 11 ,hat erfolgreich die Prüfung SP3 absolviert. Zeit: -  "},{"$f":"'SP3'!U13","v":"00:00:01.220"}]
[{"$f":"'SP3'!I14","v":"14:58:30,00"},{"$f":"'SP3'!J14","v":"15:01:05,13"},{"$f":"'SP3'!K14","v":"00:02:35,13"},{"$f":"'SP3'!L14","v":"00:02:35.130"},{"$f":"'SP3'!M14","v":"00:00:09.870"},{"$f":"'SP3'!T14","v":"Fahrer Andreas Petry mit der StartNr. 12 ,hat erfolgreich die Prüfung SP3 absolviert. Zeit: -  "},{"$f":"'SP3'!U14","v":"00:00:09.870"}]
[{"$f":"'SP3'!I15","v":"14:59:00,00"},{"$f":"'SP3'!J15","v":"15:01:45,10"},{"$f":"'SP3'!K15","v":"00:02:45,10"},{"$f":"'SP3'!L15","v":"00:02:45.100"},{"$f":"'SP3'!M15","v":"00:00:00.100"},{"$f":"'SP3'!T15","v":"Fahrer Ted Prenzel mit der StartNr. 13 ,hat erfolgreich die Prüfung SP3 absolviert. Zeit:   "},{"$f":"'SP3'!U15","v":"00:00:00.100"}]
[{"$f":"'SP3'!I16","v":"14:59:30,00"},{"$f":"'SP3'!J16","v":"15:02:09,31"},{"$f":"'SP3'!K16","v":"00:02:39,31"},{"$f":"'SP3'!L16","v":"00:02:39.310"},{"$f":"'SP3'!M16","v":"00:00:05.690"},{"$f":"'SP3'!T16","v":"Fahrer Micha Barsties mit der StartNr. 14 ,hat erfolgreich die Prüfung SP3 absolviert. Zeit: -  "},{"$f":"'SP3'!U16","v":"00:00:05.690"}]
[{"$f":"'SP3'!I17","v":""},{"$f":"'SP3'!J17","v":""},{"$f":"'SP3'!K17","v":""},{"$f":"'SP3'!L17","v":""},{"$f":"'SP3'!M17","v":{"$error":"#VALUE!"}},{"$f":"'SP3'!T17","v":""},{"$f":"'SP3'!U17","v":""}]
[{"$f":"'SP3'!I18","v":"15:00:00,00"},{"$f":"'SP3'!J18","v":"15:02:46,86"},{"$f":"'SP3'!K18","v":"00:02:46,86"},{"$f":"'SP3'!L18","v":"00:02:46.860"},{"$f":"'SP3'!M18","v":"00:00:01.860"},{"$f":"'SP3'!T18","v":"Fahrer Heinz Frey mit der StartNr. 16 ,hat erfolgreich die Prüfung SP3 absolviert. Zeit:   -"},{"$f":"'SP3'!U18","v":"00:00:01.860"}]
[{"$f":"'SP3'!I19","v":"15:00:30,00"},{"$f":"'SP3'!J19","v":"15:03:15,82"},{"$f":"'SP3'!K19","v":"00:02:45,82"},{"$f":"'SP3'!L19","v":"00:02:45.820"},{"$f":"'SP3'!M19","v":"00:00:00.820"},{"$f":"'SP3'!T19","v":"Fahrer Henning Reichel mit der StartNr. 17 ,hat erfolgreich die Prüfung SP3 absolviert. Zeit:   "},{"$f":"'SP3'!U19","v":"00:00:00.820"}]
[{"$f":"'SP3'!I20","v":"15:01:00,00"},{"$f":"'SP3'!J20","v":"15:03:45,08"},{"$f":"'SP3'!K20","v":"00:02:45,08"},{"$f":"'SP3'!L20","v":"00:02:45.080"},{"$f":"'SP3'!M20","v":"00:00:00.080"},{"$f":"'SP3'!T20","v":"Fahrer Maik Käbisch mit der StartNr. 18 ,hat erfolgreich die Prüfung SP3 absolviert. Zeit:   "},{"$f":"'SP3'!U20","v":"00:00:00.080"}]
[{"$f":"'SP3'!I21","v":"15:02:00,00"},{"$f":"'SP3'!J21","v":"15:04:44,90"},{"$f":"'SP3'!K21","v":"00:02:44,90"},{"$f":"'SP3'!L21","v":"00:02:44.900"},{"$f":"'SP3'!M21","v":"00:00:00.100"},{"$f":"'SP3'!T21","v":"Fahrer Harald Zapp mit der StartNr. 19 ,hat erfolgreich die Prüfung SP3 absolviert. Zeit: -  "},{"$f":"'SP3'!U21","v":"00:00:00.100"}]
[{"$f":"'SP3'!I22","v":"15:03:30,00"},{"$f":"'SP3'!J22","v":"15:06:16,34"},{"$f":"'SP3'!K22","v":"00:02:46,34"},{"$f":"'SP3'!L22","v":"00:02:46.340"},{"$f":"'SP3'!M22","v":"00:00:01.340"},{"$f":"'SP3'!T22","v":"Fahrer Reinhard Grzesik mit der StartNr. 20 ,hat erfolgreich die Prüfung SP3 absolviert. Zeit:   "},{"$f":"'SP3'!U22","v":"00:00:01.340"}]
[{"$f":"'SP3'!I23","v":"15:04:30,00"},{"$f":"'SP3'!J23","v":"15:07:16,51"},{"$f":"'SP3'!K23","v":"00:02:46,51"},{"$f":"'SP3'!L23","v":"00:02:46.510"},{"$f":"'SP3'!M23","v":"00:00:01.510"},{"$f":"'SP3'!T23","v":"Fahrer Jörg Sihler mit der StartNr. 21 ,hat erfolgreich die Prüfung SP3 absolviert. Zeit:   "},{"$f":"'SP3'!U23","v":"00:00:01.510"}]
[{"$f":"'SP3'!I24","v":"15:11:30,00"},{"$f":"'SP3'!J24","v":"15:14:17,27"},{"$f":"'SP3'!K24","v":"00:02:47,27"},{"$f":"'SP3'!L24","v":"00:02:47.270"},{"$f":"'SP3'!M24","v":"00:00:02.270"},{"$f":"'SP3'!T24","v":"Fahrer Ingo Winterstein mit der StartNr. 22 ,hat erfolgreich die Prüfung SP3 absolviert. Zeit:   "},{"$f":"'SP3'!U24","v":"00:00:02.270"}]
[{"$f":"'SP3'!I25","v":"15:03:00,00"},{"$f":"'SP3'!J25","v":"15:05:45,01"},{"$f":"'SP3'!K25","v":"00:02:45,01"},{"$f":"'SP3'!L25","v":"00:02:45.010"},{"$f":"'SP3'!M25","v":"00:00:00.010"},{"$f":"'SP3'!T25","v":"Fahrer Hans Werner Melchior mit der StartNr. 23 ,hat erfolgreich die Prüfung SP3 absolviert. Zeit:   "},{"$f":"'SP3'!U25","v":"00:00:00.010"}]
[{"$f":"'SP3'!I26","v":"15:55:00,00"},{"$f":"'SP3'!J26","v":"15:57:58,31"},{"$f":"'SP3'!K26","v":"00:02:58,31"},{"$f":"'SP3'!L26","v":"00:02:58.310"},{"$f":"'SP3'!M26","v":"00:00:13.310"},{"$f":"'SP3'!T26","v":"Fahrer Marco Oriolo mit der StartNr. 24 ,hat erfolgreich die Prüfung SP3 absolviert. Zeit:   "},{"$f":"'SP3'!U26","v":"00:00:13.310"}]
[{"$f":"'SP3'!I27","v":"15:02:30,00"},{"$f":"'SP3'!J27","v":"15:05:14,99"},{"$f":"'SP3'!K27","v":"00:02:44,99"},{"$f":"'SP3'!L27","v":"00:02:44.990"},{"$f":"'SP3'!M27","v":"00:00:00.010"},{"$f":"'SP3'!T27","v":"Fahrer Manfred Stommel mit der StartNr. 25 ,hat erfolgreich die Prüfung SP3 absolviert. Zeit: -  "},{"$f":"'SP3'!U27","v":"00:00:00.010"}]
[{"$f":"'SP3'!I28","v":"15:13:30,00"},{"$f":"'SP3'!J28","v":"15:16:15,65"},{"$f":"'SP3'!K28","v":"00:02:45,65"},{"$f":"'SP3'!L28","v":"00:02:45.650"},{"$f":"'SP3'!M28","v":"00:00:00.650"},{"$f":"'SP3'!T28","v":"Fahrer Carolin Heusel mit der StartNr. 26 ,hat erfolgreich die Prüfung SP3 absolviert. Zeit:   "},{"$f":"'SP3'!U28","v":"00:00:00.650"}]
[{"$f":"'SP3'!I29","v":"15:14:30,00"},{"$f":"'SP3'!J29","v":"15:17:52,92"},{"$f":"'SP3'!K29","v":"00:03:22,92"},{"$f":"'SP3'!L29","v":"00:03:22.920"},{"$f":"'SP3'!M29","v":"00:00:37.920"},{"$f":"'SP3'!T29","v":"Fahrer Regina Philippi mit der StartNr. 27 ,hat erfolgreich die Prüfung SP3 absolviert. Zeit:   "},{"$f":"'SP3'!U29","v":"00:00:37.920"}]
[{"$f":"'SP3'!I30","v":"15:06:00,00"},{"$f":"'SP3'!J30","v":"15:08:34,19"},{"$f":"'SP3'!K30","v":"00:02:34,19"},{"$f":"'SP3'!L30","v":"00:02:34.190"},{"$f":"'SP3'!M30","v":"00:00:10.810"},{"$f":"'SP3'!T30","v":"Fahrer Christof Aha mit der StartNr. 28 ,hat erfolgreich die Prüfung SP3 absolviert. Zeit: -  "},{"$f":"'SP3'!U30","v":"00:00:10.810"}]
[{"$f":"'SP3'!I31","v":"15:28:30,00"},{"$f":"'SP3'!J31","v":"15:31:13,22"},{"$f":"'SP3'!K31","v":"00:02:43,22"},{"$f":"'SP3'!L31","v":"00:02:43.220"},{"$f":"'SP3'!M31","v":"00:00:01.780"},{"$f":"'SP3'!T31","v":"Fahrer Dennis Weiss mit der StartNr. 29 ,hat erfolgreich die Prüfung SP3 absolviert. Zeit: -  "},{"$f":"'SP3'!U31","v":"00:00:01.780"}]
[{"$f":"'SP3'!I32","v":"15:33:00,00"},{"$f":"'SP3'!J32","v":"15:35:45,76"},{"$f":"'SP3'!K32","v":"00:02:45,76"},{"$f":"'SP3'!L32","v":"00:02:45.760"},{"$f":"'SP3'!M32","v":"00:00:00.760"},{"$f":"'SP3'!T32","v":"Fahrer Harald Hamprecht mit der StartNr. 30 ,hat erfolgreich die Prüfung SP3 absolviert. Zeit:   "},{"$f":"'SP3'!U32","v":"00:00:00.760"}]
[{"$f":"'SP3'!I33","v":"15:08:00,00"},{"$f":"'SP3'!J33","v":"15:10:18,42"},{"$f":"'SP3'!K33","v":"00:02:18,42"},{"$f":"'SP3'!L33","v":"00:02:18.420"},{"$f":"'SP3'!M33","v":"00:00:26.580"},{"$f":"'SP3'!T33","v":"Fahrer Reno Fiolic mit der StartNr. 31 ,hat erfolgreich die Prüfung SP3 absolviert. Zeit: -  "},{"$f":"'SP3'!U33","v":"00:00:26.580"}]
[{"$f":"'SP3'!I34","v":"15:12:30,00"},{"$f":"'SP3'!J34","v":"15:15:16,45"},{"$f":"'SP3'!K34","v":"00:02:46,45"},{"$f":"'SP3'!L34","v":"00:02:46.450"},{"$f":"'SP3'!M34","v":"00:00:01.450"},{"$f":"'SP3'!T34","v":"Fahrer Jürgen Kulpe mit der StartNr. 32 ,hat erfolgreich die Prüfung SP3 absolviert. Zeit:   "},{"$f":"'SP3'!U34","v":"00:00:01.450"}]
[{"$f":"'SP3'!I35","v":"15:05:30,00"},{"$f":"'SP3'!J35","v":"15:08:03,47"},{"$f":"'SP3'!K35","v":"00:02:33,47"},{"$f":"'SP3'!L35","v":"00:02:33.470"},{"$f":"'SP3'!M35","v":"00:00:11.530"},{"$f":"'SP3'!T35","v":"Fahrer Konstantin Kovarbasic mit der StartNr. 33 ,hat erfolgreich die Prüfung SP3 absolviert. Zeit: -  "},{"$f":"'SP3'!U35","v":"00:00:11.530"}]
[{"$f":"'SP3'!I36","v":"15:13:00,00"},{"$f":"'SP3'!J36","v":"15:15:46,14"},{"$f":"'SP3'!K36","v":"00:02:46,14"},{"$f":"'SP3'!L36","v":"00:02:46.140"},{"$f":"'SP3'!M36","v":"00:00:01.140"},{"$f":"'SP3'!T36","v":"Fahrer Nikolaus Kratz mit der StartNr. 34 ,hat erfolgreich die Prüfung SP3 absolviert. Zeit:   "},{"$f":"'SP3'!U36","v":"00:00:01.140"}]
[{"$f":"'SP3'!I37","v":"15:15:00,00"},{"$f":"'SP3'!J37","v":"15:17:54,57"},{"$f":"'SP3'!K37","v":"00:02:54,57"},{"$f":"'SP3'!L37","v":"00:02:54.570"},{"$f":"'SP3'!M37","v":"00:00:09.570"},{"$f":"'SP3'!T37","v":"Fahrer Andreas Eberhardt mit der StartNr. 35 ,hat erfolgreich die Prüfung SP3 absolviert. Zeit:   "},{"$f":"'SP3'!U37","v":"00:00:09.570"}]
[{"$f":"'SP3'!I38","v":"15:10:00"},{"$f":"'SP3'!J38","v":"15:12:44,84"},{"$f":"'SP3'!K38","v":"00:56:44,84"},{"$f":"'SP3'!L38","v":"00:02:44.840"},{"$f":"'SP3'!M38","v":"00:00:00.160"},{"$f":"'SP3'!T38","v":"Fahrer Gerhard Thomas mit der StartNr. 36 ,hat erfolgreich die Prüfung SP3 absolviert. Zeit: -  "},{"$f":"'SP3'!U38","v":"00:00:00.160"}]
[{"$f":"'SP3'!I39","v":"15:08:30,00"},{"$f":"'SP3'!J39","v":"15:11:15,32"},{"$f":"'SP3'!K39","v":"00:02:45,32"},{"$f":"'SP3'!L39","v":"00:02:45.320"},{"$f":"'SP3'!M39","v":"00:00:00.320"},{"$f":"'SP3'!T39","v":"Fahrer Lotzi Kende mit der StartNr. 37 ,hat erfolgreich die Prüfung SP3 absolviert. Zeit:   "},{"$f":"'SP3'!U39","v":"00:00:00.320"}]
[{"$f":"'SP3'!I40","v":""},{"$f":"'SP3'!J40","v":""},{"$f":"'SP3'!K40","v":""},{"$f":"'SP3'!L40","v":""},{"$f":"'SP3'!M40","v":{"$error":"#VALUE!"}},{"$f":"'SP3'!T40","v":""},{"$f":"'SP3'!U40","v":""}]
[{"$f":"'SP3'!I41","v":"15:14:00,00"},{"$f":"'SP3'!J41","v":"15:16:49,57"},{"$f":"'SP3'!K41","v":"00:02:49,57"},{"$f":"'SP3'!L41","v":"00:02:49.570"},{"$f":"'SP3'!M41","v":"00:00:04.570"},{"$f":"'SP3'!T41","v":"Fahrer Sascha Wilkesmann mit der StartNr. 39 ,hat erfolgreich die Prüfung SP3 absolviert. Zeit:   -"},{"$f":"'SP3'!U41","v":"00:00:04.570"}]
[{"$f":"'SP3'!I42","v":"15:35:00,00"},{"$f":"'SP3'!J42","v":"15:38:19,23"},{"$f":"'SP3'!K42","v":"00:03:19,23"},{"$f":"'SP3'!L42","v":"00:03:19.230"},{"$f":"'SP3'!M42","v":"00:00:34.230"},{"$f":"'SP3'!T42","v":"Fahrer Gregor Schulz mit der StartNr. 40 ,hat erfolgreich die Prüfung SP3 absolviert. Zeit:   "},{"$f":"'SP3'!U42","v":"00:00:34.230"}]
[{"$f":"'SP3'!I43","v":"15:07:00,00"},{"$f":"'SP3'!J43","v":"15:10:15,41"},{"$f":"'SP3'!K43","v":"00:03:15,41"},{"$f":"'SP3'!L43","v":"00:03:15.410"},{"$f":"'SP3'!M43","v":"00:00:30.410"},{"$f":"'SP3'!T43","v":"Fahrer Peer Hildmann mit der StartNr. 41 ,hat erfolgreich die Prüfung SP3 absolviert. Zeit:   "},{"$f":"'SP3'!U43","v":"00:00:30.410"}]
[{"$f":"'SP3'!I44","v":""},{"$f":"'SP3'!J44","v":""},{"$f":"'SP3'!K44","v":""},{"$f":"'SP3'!L44","v":""},{"$f":"'SP3'!M44","v":{"$error":"#VALUE!"}},{"$f":"'SP3'!T44","v":""},{"$f":"'SP3'!U44","v":""}]
[{"$f":"'SP3'!I45","v":"16:24:30,00"},{"$f":"'SP3'!J45","v":"16:27:30,57"},{"$f":"'SP3'!K45","v":"00:03:00,57"},{"$f":"'SP3'!L45","v":"00:03:00.570"},{"$f":"'SP3'!M45","v":"00:00:15.570"},{"$f":"'SP3'!T45","v":"Fahrer Stefan Iskan mit der StartNr. 43 ,hat erfolgreich die Prüfung SP3 absolviert. Zeit:   -"},{"$f":"'SP3'!U45","v":"00:00:15.570"}]
[{"$f":"'SP3'!I46","v":"15:29:30,00"},{"$f":"'SP3'!J46","v":"15:32:04,50"},{"$f":"'SP3'!K46","v":"00:02:34,50"},{"$f":"'SP3'!L46","v":"00:02:34.500"},{"$f":"'SP3'!M46","v":"00:00:10.500"},{"$f":"'SP3'!T46","v":"Fahrer Jean-Philippe Kempf mit der StartNr. 44 ,hat erfolgreich die Prüfung SP3 absolviert. Zeit: -  "},{"$f":"'SP3'!U46","v":"00:00:10.500"}]
[{"$f":"'SP3'!I47","v":"15:18:00,00"},{"$f":"'SP3'!J47","v":"15:20:45,39"},{"$f":"'SP3'!K47","v":"00:02:45,39"},{"$f":"'SP3'!L47","v":"00:02:45.390"},{"$f":"'SP3'!M47","v":"00:00:00.390"},{"$f":"'SP3'!T47","v":"Fahrer Daniel Martin mit der StartNr. 45 ,hat erfolgreich die Prüfung SP3 absolviert. Zeit:   "},{"$f":"'SP3'!U47","v":"00:00:00.390"}]
[{"$f":"'SP3'!I48","v":"16:13:00,00"},{"$f":"'SP3'!J48","v":"16:15:45,19"},{"$f":"'SP3'!K48","v":"00:02:45,19"},{"$f":"'SP3'!L48","v":"00:02:45.190"},{"$f":"'SP3'!M48","v":"00:00:00.190"},{"$f":"'SP3'!T48","v":"Fahrer Elena Funk mit der StartNr. 46 ,hat erfolgreich die Prüfung SP3 absolviert. Zeit:   "},{"$f":"'SP3'!U48","v":"00:00:00.190"}]
[{"$f":"'SP3'!I49","v":"15:16:00,00"},{"$f":"'SP3'!J49","v":"15:18:45,16"},{"$f":"'SP3'!K49","v":"00:02:45,16"},{"$f":"'SP3'!L49","v":"00:02:45.160"},{"$f":"'SP3'!M49","v":"00:00:00.160"},{"$f":"'SP3'!T49","v":"Fahrer Hans Mutschall mit der StartNr. 47 ,hat erfolgreich die Prüfung SP3 absolviert. Zeit:   "},{"$f":"'SP3'!U49","v":"00:00:00.160"}]
[{"$f":"'SP3'!I50","v":"15:17:00,00"},{"$f":"'SP3'!J50","v":"15:19:46,04"},{"$f":"'SP3'!K50","v":"00:02:46,04"},{"$f":"'SP3'!L50","v":"00:02:46.040"},{"$f":"'SP3'!M50","v":"00:00:01.040"},{"$f":"'SP3'!T50","v":"Fahrer Kahled Rahman mit der StartNr. 48 ,hat erfolgreich die Prüfung SP3 absolviert. Zeit:   "},{"$f":"'SP3'!U50","v":"00:00:01.040"}]
[{"$f":"'SP3'!I51","v":"15:19:30,00"},{"$f":"'SP3'!J51","v":"15:22:15,45"},{"$f":"'SP3'!K51","v":"00:02:45,45"},{"$f":"'SP3'!L51","v":"00:02:45.450"},{"$f":"'SP3'!M51","v":"00:00:00.450"},{"$f":"'SP3'!T51","v":"Fahrer Jochen Schwarz mit der StartNr. 49 ,hat erfolgreich die Prüfung SP3 absolviert. Zeit:   "},{"$f":"'SP3'!U51","v":"00:00:00.450"}]
[{"$f":"'SP3'!I52","v":""},{"$f":"'SP3'!J52","v":""},{"$f":"'SP3'!K52","v":""},{"$f":"'SP3'!L52","v":""},{"$f":"'SP3'!M52","v":{"$error":"#VALUE!"}},{"$f":"'SP3'!T52","v":""},{"$f":"'SP3'!U52","v":""}]
[{"$f":"'SP3'!I53","v":"15:27:00,00"},{"$f":"'SP3'!J53","v":"15:29:42,59"},{"$f":"'SP3'!K53","v":"00:02:42,59"},{"$f":"'SP3'!L53","v":"00:02:42.590"},{"$f":"'SP3'!M53","v":"00:00:02.410"},{"$f":"'SP3'!T53","v":"Fahrer Birgit Claussen mit der StartNr. 51 ,hat erfolgreich die Prüfung SP3 absolviert. Zeit: -  -"},{"$f":"'SP3'!U53","v":"00:00:02.410"}]
[{"$f":"'SP3'!I54","v":"15:31:00,00"},{"$f":"'SP3'!J54","v":"15:33:46,64"},{"$f":"'SP3'!K54","v":"00:02:46,64"},{"$f":"'SP3'!L54","v":"00:02:46.640"},{"$f":"'SP3'!M54","v":"00:00:01.640"},{"$f":"'SP3'!T54","v":"Fahrer Harald König mit der StartNr. 52 ,hat erfolgreich die Prüfung SP3 absolviert. Zeit:   "},{"$f":"'SP3'!U54","v":"00:00:01.640"}]
[{"$f":"'SP3'!I55","v":"15:26:00,00"},{"$f":"'SP3'!J55","v":"15:28:43,24"},{"$f":"'SP3'!K55","v":"00:02:43,24"},{"$f":"'SP3'!L55","v":"00:02:43.240"},{"$f":"'SP3'!M55","v":"00:00:01.760"},{"$f":"'SP3'!T55","v":"Fahrer Thomas Blank mit der StartNr. 53 ,hat erfolgreich die Prüfung SP3 absolviert. Zeit: -  "},{"$f":"'SP3'!U55","v":"00:00:01.760"}]
[{"$f":"'SP3'!I56","v":"15:47:00,00"},{"$f":"'SP3'!J56","v":"15:50:12,48"},{"$f":"'SP3'!K56","v":"00:03:12,48"},{"$f":"'SP3'!L56","v":"00:03:12.480"},{"$f":"'SP3'!M56","v":"00:00:27.480"},{"$f":"'SP3'!T56","v":"Fahrer Heidi Eberhardt mit der StartNr. 54 ,hat erfolgreich die Prüfung SP3 absolviert. Zeit:   "},{"$f":"'SP3'!U56","v":"00:00:27.480"}]
[{"$f":"'SP3'!I57","v":"15:27:30,00"},{"$f":"'SP3'!J57","v":"15:30:14,60"},{"$f":"'SP3'!K57","v":"00:02:44,60"},{"$f":"'SP3'!L57","v":"00:02:44.600"},{"$f":"'SP3'!M57","v":"00:00:00.400"},{"$f":"'SP3'!T57","v":"Fahrer Karina Ansos mit der StartNr. 55 ,hat erfolgreich die Prüfung SP3 absolviert. Zeit: -  "},{"$f":"'SP3'!U57","v":"00:00:00.400"}]
[{"$f":"'SP3'!I58","v":"15:23:00,00"},{"$f":"'SP3'!J58","v":"15:25:49,03"},{"$f":"'SP3'!K58","v":"00:02:49,03"},{"$f":"'SP3'!L58","v":"00:02:49.030"},{"$f":"'SP3'!M58","v":"00:00:04.030"},{"$f":"'SP3'!T58","v":"Fahrer Michael Gotta mit der StartNr. 56 ,hat erfolgreich die Prüfung SP3 absolviert. Zeit:   "},{"$f":"'SP3'!U58","v":"00:00:04.030"}]
[{"$f":"'SP3'!I59","v":"15:51:00,00"},{"$f":"'SP3'!J59","v":"15:53:45,33"},{"$f":"'SP3'!K59","v":"00:02:45,33"},{"$f":"'SP3'!L59","v":"00:02:45.330"},{"$f":"'SP3'!M59","v":"00:00:00.330"},{"$f":"'SP3'!T59","v":"Fahrer Stefanie Rinck mit der StartNr. 57 ,hat erfolgreich die Prüfung SP3 absolviert. Zeit:   "},{"$f":"'SP3'!U59","v":"00:00:00.330"}]
[{"$f":"'SP3'!I60","v":"15:36:00,00"},{"$f":"'SP3'!J60","v":"15:38:34,12"},{"$f":"'SP3'!K60","v":"00:02:34,12"},{"$f":"'SP3'!L60","v":"00:02:34.120"},{"$f":"'SP3'!M60","v":"00:00:10.880"},{"$f":"'SP3'!T60","v":"Fahrer Armin Slotta mit der StartNr. 58 ,hat erfolgreich die Prüfung SP3 absolviert. Zeit: -  "},{"$f":"'SP3'!U60","v":"00:00:10.880"}]
[{"$f":"'SP3'!I61","v":"15:57:00,00"},{"$f":"'SP3'!J61","v":"15:59:46,33"},{"$f":"'SP3'!K61","v":"00:02:46,33"},{"$f":"'SP3'!L61","v":"00:02:46.330"},{"$f":"'SP3'!M61","v":"00:00:01.330"},{"$f":"'SP3'!T61","v":"Fahrer Julia Kende mit der StartNr. 59 ,hat erfolgreich die Prüfung SP3 absolviert. Zeit:   "},{"$f":"'SP3'!U61","v":"00:00:01.330"}]
[{"$f":"'SP3'!I62","v":"15:34:00,00"},{"$f":"'SP3'!J62","v":"15:36:46,83"},{"$f":"'SP3'!K62","v":"00:02:46,83"},{"$f":"'SP3'!L62","v":"00:02:46.830"},{"$f":"'SP3'!M62","v":"00:00:01.830"},{"$f":"'SP3'!T62","v":"Fahrer Robert Bleckmann mit der StartNr. 60 ,hat erfolgreich die Prüfung SP3 absolviert. Zeit:   "},{"$f":"'SP3'!U62","v":"00:00:01.830"}]
[{"$f":"'SP3'!I63","v":"15:31:30,00"},{"$f":"'SP3'!J63","v":"15:35:22,07"},{"$f":"'SP3'!K63","v":"00:03:52,07"},{"$f":"'SP3'!L63","v":"00:03:52.070"},{"$f":"'SP3'!M63","v":"00:01:07.070"},{"$f":"'SP3'!T63","v":"Fahrer Christof Harwardt mit der StartNr. 61 ,hat erfolgreich die Prüfung SP3 absolviert. Zeit:   "},{"$f":"'SP3'!U63","v":"00:01:07.070"}]
[{"$f":"'SP3'!I64","v":"16:02:00,00"},{"$f":"'SP3'!J64","v":"16:04:44,97"},{"$f":"'SP3'!K64","v":"00:02:44,97"},{"$f":"'SP3'!L64","v":"00:02:44.970"},{"$f":"'SP3'!M64","v":"00:00:00.030"},{"$f":"'SP3'!T64","v":"Fahrer Thomas Kahns mit der StartNr. 62 ,hat erfolgreich die Prüfung SP3 absolviert. Zeit: -  "},{"$f":"'SP3'!U64","v":"00:00:00.030"}]
[{"$f":"'SP3'!I65","v":"15:25:00,00"},{"$f":"'SP3'!J65","v":"15:27:45,01"},{"$f":"'SP3'!K65","v":"00:02:45,01"},{"$f":"'SP3'!L65","v":"00:02:45.010"},{"$f":"'SP3'!M65","v":"00:00:00.010"},{"$f":"'SP3'!T65","v":"Fahrer Maximilian Herbst mit der StartNr. 63 ,hat erfolgreich die Prüfung SP3 absolviert. Zeit:   "},{"$f":"'SP3'!U65","v":"00:00:00.010"}]
[{"$f":"'SP3'!I66","v":"15:53:30,00"},{"$f":"'SP3'!J66","v":"15:56:18,03"},{"$f":"'SP3'!K66","v":"00:02:48,03"},{"$f":"'SP3'!L66","v":"00:02:48.030"},{"$f":"'SP3'!M66","v":"00:00:03.030"},{"$f":"'SP3'!T66","v":"Fahrer Jürgen Buchhold mit der StartNr. 64 ,hat erfolgreich die Prüfung SP3 absolviert. Zeit:   "},{"$f":"'SP3'!U66","v":"00:00:03.030"}]
[{"$f":"'SP3'!I67","v":""},{"$f":"'SP3'!J67","v":""},{"$f":"'SP3'!K67","v":""},{"$f":"'SP3'!L67","v":""},{"$f":"'SP3'!M67","v":{"$error":"#VALUE!"}},{"$f":"'SP3'!T67","v":""},{"$f":"'SP3'!U67","v":""}]
[{"$f":"'SP3'!I68","v":"15:46:30,00"},{"$f":"'SP3'!J68","v":"15:49:11,37"},{"$f":"'SP3'!K68","v":"00:02:41,37"},{"$f":"'SP3'!L68","v":"00:02:41.370"},{"$f":"'SP3'!M68","v":"00:00:03.630"},{"$f":"'SP3'!T68","v":"Fahrer Peter Bel mit der StartNr. 66 ,hat erfolgreich die Prüfung SP3 absolviert. Zeit: -  -"},{"$f":"'SP3'!U68","v":"00:00:03.630"}]
[{"$f":"'SP3'!I69","v":"15:43:00,00"},{"$f":"'SP3'!J69","v":"15:45:45,55"},{"$f":"'SP3'!K69","v":"00:02:45,55"},{"$f":"'SP3'!L69","v":"00:02:45.550"},{"$f":"'SP3'!M69","v":"00:00:00.550"},{"$f":"'SP3'!T69","v":"Fahrer Thomas Mirau mit der StartNr. 67 ,hat erfolgreich die Prüfung SP3 absolviert. Zeit:   "},{"$f":"'SP3'!U69","v":"00:00:00.550"}]
[{"$f":"'SP3'!I70","v":"15:24:00,10"},{"$f":"'SP3'!J70","v":"15:26:01,08"},{"$f":"'SP3'!K70","v":"00:02:00,98"},{"$f":"'SP3'!L70","v":"00:02:00.980"},{"$f":"'SP3'!M70","v":"00:00:44.020"},{"$f":"'SP3'!T70","v":"Fahrer Markus Gotta mit der StartNr. 68 ,hat erfolgreich die Prüfung SP3 absolviert. Zeit: -  "},{"$f":"'SP3'!U70","v":"00:00:44.020"}]
[{"$f":"'SP3'!I71","v":"15:50:00,00"},{"$f":"'SP3'!J71","v":"15:52:45,58"},{"$f":"'SP3'!K71","v":"00:02:45,58"},{"$f":"'SP3'!L71","v":"00:02:45.580"},{"$f":"'SP3'!M71","v":"00:00:00.580"},{"$f":"'SP3'!T71","v":"Fahrer Robin Keulertz mit der StartNr. 69 ,hat erfolgreich die Prüfung SP3 absolviert. Zeit:   "},{"$f":"'SP3'!U71","v":"00:00:00.580"}]
[{"$f":"'SP3'!I72","v":""},{"$f":"'SP3'!J72","v":""},{"$f":"'SP3'!K72","v":""},{"$f":"'SP3'!L72","v":""},{"$f":"'SP3'!M72","v":{"$error":"#VALUE!"}},{"$f":"'SP3'!T72","v":""},{"$f":"'SP3'!U72","v":""}]
[{"$f":"'SP3'!I73","v":"15:38:00,00"},{"$f":"'SP3'!J73","v":"15:40:40,84"},{"$f":"'SP3'!K73","v":"00:02:40,84"},{"$f":"'SP3'!L73","v":"00:02:40.840"},{"$f":"'SP3'!M73","v":"00:00:04.160"},{"$f":"'SP3'!T73","v":"Fahrer Ingolf Zschockelt mit der StartNr. 71 ,hat erfolgreich die Prüfung SP3 absolviert. Zeit: -  -"},{"$f":"'SP3'!U73","v":"00:00:04.160"}]
[{"$f":"'SP3'!I74","v":""},{"$f":"'SP3'!J74","v":""},{"$f":"'SP3'!K74","v":""},{"$f":"'SP3'!L74","v":""},{"$f":"'SP3'!M74","v":{"$error":"#VALUE!"}},{"$f":"'SP3'!T74","v":""},{"$f":"'SP3'!U74","v":""}]
[{"$f":"'SP3'!I75","v":"15:44:00,00"},{"$f":"'SP3'!J75","v":"15:46:08,61"},{"$f":"'SP3'!K75","v":"00:02:08,61"},{"$f":"'SP3'!L75","v":"00:02:08.610"},{"$f":"'SP3'!M75","v":"00:00:36.390"},{"$f":"'SP3'!T75","v":"Fahrer Ramona Wagner mit der StartNr. 73 ,hat erfolgreich die Prüfung SP3 absolviert. Zeit: -  -"},{"$f":"'SP3'!U75","v":"00:00:36.390"}]
[{"$f":"'SP3'!I76","v":"16:11:30,00"},{"$f":"'SP3'!J76","v":"16:14:14,46"},{"$f":"'SP3'!K76","v":"00:02:44,46"},{"$f":"'SP3'!L76","v":"00:02:44.460"},{"$f":"'SP3'!M76","v":"00:00:00.540"},{"$f":"'SP3'!T76","v":"Fahrer Lars Fahrenbach mit der StartNr. 74 ,hat erfolgreich die Prüfung SP3 absolviert. Zeit: -  "},{"$f":"'SP3'!U76","v":"00:00:00.540"}]
[{"$f":"'SP3'!I77","v":"15:33:30,00"},{"$f":"'SP3'!J77","v":"15:36:14,34"},{"$f":"'SP3'!K77","v":"00:02:44,34"},{"$f":"'SP3'!L77","v":"00:02:44.340"},{"$f":"'SP3'!M77","v":"00:00:00.660"},{"$f":"'SP3'!T77","v":"Fahrer Frank Hoefnagels mit der StartNr. 75 ,hat erfolgreich die Prüfung SP3 absolviert. Zeit: -  "},{"$f":"'SP3'!U77","v":"00:00:00.660"}]
[{"$f":"'SP3'!I78","v":"15:37:00,00"},{"$f":"'SP3'!J78","v":"15:39:48,09"},{"$f":"'SP3'!K78","v":"00:02:48,09"},{"$f":"'SP3'!L78","v":"00:02:48.090"},{"$f":"'SP3'!M78","v":"00:00:03.090"},{"$f":"'SP3'!T78","v":"Fahrer Michael Karch mit der StartNr. 76 ,hat erfolgreich die Prüfung SP3 absolviert. Zeit:   "},{"$f":"'SP3'!U78","v":"00:00:03.090"}]
[{"$f":"'SP3'!I79","v":"15:44:30,00"},{"$f":"'SP3'!J79","v":"15:47:14,36"},{"$f":"'SP3'!K79","v":"00:02:44,36"},{"$f":"'SP3'!L79","v":"00:02:44.360"},{"$f":"'SP3'!M79","v":"00:00:00.640"},{"$f":"'SP3'!T79","v":"Fahrer Dirk Götze mit der StartNr. 77 ,hat erfolgreich die Prüfung SP3 absolviert. Zeit: -  "},{"$f":"'SP3'!U79","v":"00:00:00.640"}]
[{"$f":"'SP3'!I80","v":"15:58:00,00"},{"$f":"'SP3'!J80","v":"16:00:45,95"},{"$f":"'SP3'!K80","v":"00:02:45,95"},{"$f":"'SP3'!L80","v":"00:02:45.950"},{"$f":"'SP3'!M80","v":"00:00:00.950"},{"$f":"'SP3'!T80","v":"Fahrer Stefan Hillers mit der StartNr. 78 ,hat erfolgreich die Prüfung SP3 absolviert. Zeit:   "},{"$f":"'SP3'!U80","v":"00:00:00.950"}]
[{"$f":"'SP3'!I81","v":"15:46:00,00"},{"$f":"'SP3'!J81","v":"15:48:45,58"},{"$f":"'SP3'!K81","v":"00:02:45,58"},{"$f":"'SP3'!L81","v":"00:02:45.580"},{"$f":"'SP3'!M81","v":"00:00:00.580"},{"$f":"'SP3'!T81","v":"Fahrer Christian Rafflenbeul mit der StartNr. 79 ,hat erfolgreich die Prüfung SP3 absolviert. Zeit:   "},{"$f":"'SP3'!U81","v":"00:00:00.580"}]
[{"$f":"'SP3'!I82","v":"15:42:00,00"},{"$f":"'SP3'!J82","v":"15:44:54,97"},{"$f":"'SP3'!K82","v":"00:02:54,97"},{"$f":"'SP3'!L82","v":"00:02:54.970"},{"$f":"'SP3'!M82","v":"00:00:09.970"},{"$f":"'SP3'!T82","v":"Fahrer Gerhard Reuschel mit der StartNr. 80 ,hat erfolgreich die Prüfung SP3 absolviert. Zeit:   "},{"$f":"'SP3'!U82","v":"00:00:09.970"}]
[{"$f":"'SP3'!I83","v":"15:53:00,00"},{"$f":"'SP3'!J83","v":"15:55:38,48"},{"$f":"'SP3'!K83","v":"00:02:38,48"},{"$f":"'SP3'!L83","v":"00:02:38.480"},{"$f":"'SP3'!M83","v":"00:00:06.520"},{"$f":"'SP3'!T83","v":"Fahrer Karsten Rachow mit der StartNr. 81 ,hat erfolgreich die Prüfung SP3 absolviert. Zeit: -  "},{"$f":"'SP3'!U83","v":"00:00:06.520"}]
[{"$f":"'SP3'!I84","v":""},{"$f":"'SP3'!J84","v":""},{"$f":"'SP3'!K84","v":""},{"$f":"'SP3'!L84","v":""},{"$f":"'SP3'!M84","v":{"$error":"#VALUE!"}},{"$f":"'SP3'!T84","v":""},{"$f":"'SP3'!U84","v":""}]
[{"$f":"'SP3'!I85","v":"15:52:30,00"},{"$f":"'SP3'!J85","v":"15:55:16,16"},{"$f":"'SP3'!K85","v":"00:02:46,16"},{"$f":"'SP3'!L85","v":"00:02:46.160"},{"$f":"'SP3'!M85","v":"00:00:01.160"},{"$f":"'SP3'!T85","v":"Fahrer Alexander Weil mit der StartNr. 83 ,hat erfolgreich die Prüfung SP3 absolviert. Zeit:   -"},{"$f":"'SP3'!U85","v":"00:00:01.160"}]
[{"$f":"'SP3'!I86","v":"16:07:30,00"},{"$f":"'SP3'!J86","v":"16:10:30,54"},{"$f":"'SP3'!K86","v":"00:03:00,54"},{"$f":"'SP3'!L86","v":"00:03:00.540"},{"$f":"'SP3'!M86","v":"00:00:15.540"},{"$f":"'SP3'!T86","v":"Fahrer Josef Lindenberger mit der StartNr. 84 ,hat erfolgreich die Prüfung SP3 absolviert. Zeit:   "},{"$f":"'SP3'!U86","v":"00:00:15.540"}]
[{"$f":"'SP3'!I87","v":"15:48:30,00"},{"$f":"'SP3'!J87","v":"15:51:01,14"},{"$f":"'SP3'!K87","v":"00:02:31,14"},{"$f":"'SP3'!L87","v":"00:02:31.140"},{"$f":"'SP3'!M87","v":"00:00:13.860"},{"$f":"'SP3'!T87","v":"Fahrer Rick Durante mit der StartNr. 85 ,hat erfolgreich die Prüfung SP3 absolviert. Zeit: -  "},{"$f":"'SP3'!U87","v":"00:00:13.860"}]
[{"$f":"'SP3'!I88","v":"15:48:00,00"},{"$f":"'SP3'!J88","v":"15:50:44,69"},{"$f":"'SP3'!K88","v":"00:02:44,69"},{"$f":"'SP3'!L88","v":"00:02:44.690"},{"$f":"'SP3'!M88","v":"00:00:00.310"},{"$f":"'SP3'!T88","v":"Fahrer Almuth Siemann mit der StartNr. 86 ,hat erfolgreich die Prüfung SP3 absolviert. Zeit: -  "},{"$f":"'SP3'!U88","v":"00:00:00.310"}]
[{"$f":"'SP3'!I89","v":"16:08:30,00"},{"$f":"'SP3'!J89","v":"16:11:00,88"},{"$f":"'SP3'!K89","v":"00:02:30,88"},{"$f":"'SP3'!L89","v":"00:02:30.880"},{"$f":"'SP3'!M89","v":"00:00:14.120"},{"$f":"'SP3'!T89","v":"Fahrer Axel Strigl mit der StartNr. 87 ,hat erfolgreich die Prüfung SP3 absolviert. Zeit: -  "},{"$f":"'SP3'!U89","v":"00:00:14.120"}]
[{"$f":"'SP3'!I90","v":"15:20:30,00"},{"$f":"'SP3'!J90","v":"15:23:15,58"},{"$f":"'SP3'!K90","v":"00:02:45,58"},{"$f":"'SP3'!L90","v":"00:02:45.580"},{"$f":"'SP3'!M90","v":"00:00:00.580"},{"$f":"'SP3'!T90","v":"Fahrer Philip Sommer mit der StartNr. 88 ,hat erfolgreich die Prüfung SP3 absolviert. Zeit:   "},{"$f":"'SP3'!U90","v":"00:00:00.580"}]
[{"$f":"'SP3'!I91","v":"16:09:30,00"},{"$f":"'SP3'!J91","v":"16:12:15,67"},{"$f":"'SP3'!K91","v":"00:02:45,67"},{"$f":"'SP3'!L91","v":"00:02:45.670"},{"$f":"'SP3'!M91","v":"00:00:00.670"},{"$f":"'SP3'!T91","v":"Fahrer Jörg Diehl mit der StartNr. 89 ,hat erfolgreich die Prüfung SP3 absolviert. Zeit:   "},{"$f":"'SP3'!U91","v":"00:00:00.670"}]
[{"$f":"'SP3'!I92","v":"16:04:30,00"},{"$f":"'SP3'!J92","v":"16:07:14,49"},{"$f":"'SP3'!K92","v":"00:02:44,49"},{"$f":"'SP3'!L92","v":"00:02:44.490"},{"$f":"'SP3'!M92","v":"00:00:00.510"},{"$f":"'SP3'!T92","v":"Fahrer Matthias Herzig mit der StartNr. 90 ,hat erfolgreich die Prüfung SP3 absolviert. Zeit: -  "},{"$f":"'SP3'!U92","v":"00:00:00.510"}]
[{"$f":"'SP3'!I93","v":"15:45:00,00"},{"$f":"'SP3'!J93","v":"15:47:47,05"},{"$f":"'SP3'!K93","v":"00:02:47,05"},{"$f":"'SP3'!L93","v":"00:02:47.050"},{"$f":"'SP3'!M93","v":"00:00:02.050"},{"$f":"'SP3'!T93","v":"Fahrer Christoph Pasternak mit der StartNr. 91 ,hat erfolgreich die Prüfung SP3 absolviert. Zeit:   "},{"$f":"'SP3'!U93","v":"00:00:02.050"}]
[{"$f":"'SP3'!I94","v":"16:00:00,00"},{"$f":"'SP3'!J94","v":"16:02:45,98"},{"$f":"'SP3'!K94","v":"00:02:45,98"},{"$f":"'SP3'!L94","v":"00:02:45.980"},{"$f":"'SP3'!M94","v":"00:00:00.980"},{"$f":"'SP3'!T94","v":"Fahrer Lothar Schupet mit der StartNr. 92 ,hat erfolgreich die Prüfung SP3 absolviert. Zeit:   "},{"$f":"'SP3'!U94","v":"00:00:00.980"}]
[{"$f":"'SP3'!I95","v":"15:56:00,00"},{"$f":"'SP3'!J95","v":"15:58:54,78"},{"$f":"'SP3'!K95","v":"00:02:54,78"},{"$f":"'SP3'!L95","v":"00:02:54.780"},{"$f":"'SP3'!M95","v":"00:00:09.780"},{"$f":"'SP3'!T95","v":"Fahrer Wolfgang Schertler mit der StartNr. 93 ,hat erfolgreich die Prüfung SP3 absolviert. Zeit:   "},{"$f":"'SP3'!U95","v":"00:00:09.780"}]
[{"$f":"'SP3'!I96","v":"16:10:30,00"},{"$f":"'SP3'!J96","v":"16:13:15,50"},{"$f":"'SP3'!K96","v":"00:02:45,50"},{"$f":"'SP3'!L96","v":"00:02:45.500"},{"$f":"'SP3'!M96","v":"00:00:00.500"},{"$f":"'SP3'!T96","v":"Fahrer Thomas Katzensteiner mit der StartNr. 94 ,hat erfolgreich die Prüfung SP3 absolviert. Zeit:   "},{"$f":"'SP3'!U96","v":"00:00:00.500"}]
[{"$f":"'SP3'!I97","v":""},{"$f":"'SP3'!J97","v":""},{"$f":"'SP3'!K97","v":""},{"$f":"'SP3'!L97","v":""},{"$f":"'SP3'!M97","v":{"$error":"#VALUE!"}},{"$f":"'SP3'!T97","v":""},{"$f":"'SP3'!U97","v":""}]
[{"$f":"'SP3'!I98","v":"16:06:00,00"},{"$f":"'SP3'!J98","v":"16:08:45,16"},{"$f":"'SP3'!K98","v":"00:02:45,16"},{"$f":"'SP3'!L98","v":"00:02:45.160"},{"$f":"'SP3'!M98","v":"00:00:00.160"},{"$f":"'SP3'!T98","v":"Fahrer Oliver Dietz mit der StartNr. 96 ,hat erfolgreich die Prüfung SP3 absolviert. Zeit:   -"},{"$f":"'SP3'!U98","v":"00:00:00.160"}]
[{"$f":"'SP3'!I99","v":"15:59:00,00"},{"$f":"'SP3'!J99","v":"16:01:44,35"},{"$f":"'SP3'!K99","v":"00:02:44,35"},{"$f":"'SP3'!L99","v":"00:02:44.350"},{"$f":"'SP3'!M99","v":"00:00:00.650"},{"$f":"'SP3'!T99","v":"Fahrer Horst Kempf mit der StartNr. 97 ,hat erfolgreich die Prüfung SP3 absolviert. Zeit: -  "},{"$f":"'SP3'!U99","v":"00:00:00.650"}]
[{"$f":"'SP3'!I100","v":"16:18:00,00"},{"$f":"'SP3'!J100","v":"16:20:41,74"},{"$f":"'SP3'!K100","v":"00:02:41,74"},{"$f":"'SP3'!L100","v":"00:02:41.740"},{"$f":"'SP3'!M100","v":"00:00:03.260"},{"$f":"'SP3'!T100","v":"Fahrer Detlev Pauer mit der StartNr. 98 ,hat erfolgreich die Prüfung SP3 absolviert. Zeit: -  "},{"$f":"'SP3'!U100","v":"00:00:03.260"}]
[{"$f":"'SP3'!I101","v":"16:06:30,00"},{"$f":"'SP3'!J101","v":"16:09:15,85"},{"$f":"'SP3'!K101","v":"00:02:45,85"},{"$f":"'SP3'!L101","v":"00:02:45.850"},{"$f":"'SP3'!M101","v":"00:00:00.850"},{"$f":"'SP3'!T101","v":"Fahrer Dirk Velte mit der StartNr. 99 ,hat erfolgreich die Prüfung SP3 absolviert. Zeit:   "},{"$f":"'SP3'!U101","v":"00:00:00.850"}]
[{"$f":"'SP3'!I102","v":"15:47:30,00"},{"$f":"'SP3'!J102","v":"15:50:14,92"},{"$f":"'SP3'!K102","v":"00:02:44,92"},{"$f":"'SP3'!L102","v":"00:02:44.920"},{"$f":"'SP3'!M102","v":"00:00:00.080"},{"$f":"'SP3'!T102","v":"Fahrer Thorsten Krack mit der StartNr. 100 ,hat erfolgreich die Prüfung SP3 absolviert. Zeit: -  "},{"$f":"'SP3'!U102","v":"00:00:00.080"}]
[{"$f":"'SP3'!I103","v":"16:03:30,00"},{"$f":"'SP3'!J103","v":"16:05:59,49"},{"$f":"'SP3'!K103","v":"00:02:29,49"},{"$f":"'SP3'!L103","v":"00:02:29.490"},{"$f":"'SP3'!M103","v":"00:00:15.510"},{"$f":"'SP3'!T103","v":"Fahrer Christian Wittek mit der StartNr. 101 ,hat erfolgreich die Prüfung SP3 absolviert. Zeit: -  "},{"$f":"'SP3'!U103","v":"00:00:15.510"}]
[{"$f":"'SP3'!I104","v":"15:49:00,00"},{"$f":"'SP3'!J104","v":"15:51:57,70"},{"$f":"'SP3'!K104","v":"00:02:57,70"},{"$f":"'SP3'!L104","v":"00:02:57.700"},{"$f":"'SP3'!M104","v":"00:00:12.700"},{"$f":"'SP3'!T104","v":"Fahrer Benjamin Hix mit der StartNr. 102 ,hat erfolgreich die Prüfung SP3 absolviert. Zeit:   "},{"$f":"'SP3'!U104","v":"00:00:12.700"}]

{"sheet":"Export_SP4","index":11,"n_rows":102,"n_cols":8,"rows_kept":102,"cut":false,"hidden":false,"merged":[]}
[{"$f":"'SP4'!I3","v":"15:20:00,00"},{"$f":"'SP4'!J3","v":"15:22:10,13"},{"$f":"'SP4'!K3","v":"00:02:10.130"},{"$f":"'SP4'!L3","v":"00:02:10.130"},{"$f":"'SP4'!M3","v":"00:00:00.130"},{"$f":"'SP4'!S3","v":"Fahrer Christian Jäger mit der StartNr. 1 ,hat erfolgreich die Prüfung SP4 absolviert. Zeit: "},{"$f":"'SP4'!T3","v":"00:00:00.130"},{"$f":"'SP4'!V3","v":0}]
[{"$f":"'SP4'!I4","v":"15:21:00,00"},{"$f":"'SP4'!J4","v":"15:23:10,63"},{"$f":"'SP4'!K4","v":"00:02:10.630"},{"$f":"'SP4'!L4","v":"00:02:10.630"},{"$f":"'SP4'!M4","v":"00:00:00.630"},{"$f":"'SP4'!S4","v":"Fahrer Daniel Rinck mit der StartNr. 2 ,hat erfolgreich die Prüfung SP4 absolviert. Zeit: "},{"$f":"'SP4'!T4","v":"00:00:00.630"},{"$f":"'SP4'!V4","v":0}]
[{"$f":"'SP4'!I5","v":""},{"$f":"'SP4'!J5","v":"15:29:41,29"},{"$f":"'SP4'!K5","v":""},{"$f":"'SP4'!L5","v":""},{"$f":"'SP4'!M5","v":{"$error":"#VALUE!"}},{"$f":"'SP4'!S5","v":""},{"$f":"'SP4'!T5","v":""},{"$f":"'SP4'!V5","v":0}]
[{"$f":"'SP4'!I6","v":""},{"$f":"'SP4'!J6","v":"15:30:10,52"},{"$f":"'SP4'!K6","v":""},{"$f":"'SP4'!L6","v":""},{"$f":"'SP4'!M6","v":{"$error":"#VALUE!"}},{"$f":"'SP4'!S6","v":""},{"$f":"'SP4'!T6","v":""},{"$f":"'SP4'!V6","v":0}]
[{"$f":"'SP4'!I7","v":"15:21:30,00"},{"$f":"'SP4'!J7","v":"15:23:40,59"},{"$f":"'SP4'!K7","v":"00:02:10.590"},{"$f":"'SP4'!L7","v":"00:02:10.590"},{"$f":"'SP4'!M7","v":"00:00:00.590"},{"$f":"'SP4'!S7","v":"Fahrer Franz-Michael Hartmann mit der StartNr. 5 ,hat erfolgreich die Prüfung SP4 absolviert. Zeit: "},{"$f":"'SP4'!T7","v":"00:00:00.590"},{"$f":"'SP4'!V7","v":0}]
[{"$f":"'SP4'!I8","v":"15:24:30,00"},{"$f":"'SP4'!J8","v":"15:26:39,23"},{"$f":"'SP4'!K8","v":"00:02:09.230"},{"$f":"'SP4'!L8","v":"00:02:09.230"},{"$f":"'SP4'!M8","v":"00:00:00.770"},{"$f":"'SP4'!S8","v":"Fahrer Christoph Schroer mit der StartNr. 6 ,hat erfolgreich die Prüfung SP4 absolviert. Zeit: -"},{"$f":"'SP4'!T8","v":"00:00:00.770"},{"$f":"'SP4'!V8","v":0}]
[{"$f":"'SP4'!I9","v":"15:22:30,00"},{"$f":"'SP4'!J9","v":"15:24:38,66"},{"$f":"'SP4'!K9","v":"00:02:08.660"},{"$f":"'SP4'!L9","v":"00:02:08.660"},{"$f":"'SP4'!M9","v":"00:00:01.340"},{"$f":"'SP4'!S9","v":"Fahrer Jochen Artzinger-Bolten mit der StartNr. 7 ,hat erfolgreich die Prüfung SP4 absolviert. Zeit: -"},{"$f":"'SP4'!T9","v":"00:00:01.340"},{"$f":"'SP4'!V9","v":0}]
[{"$f":"'SP4'!I10","v":"15:22:00,00"},{"$f":"'SP4'!J10","v":"15:24:11,34"},{"$f":"'SP4'!K10","v":"00:02:11.340"},{"$f":"'SP4'!L10","v":"00:02:11.340"},{"$f":"'SP4'!M10","v":"00:00:01.340"},{"$f":"'SP4'!S10","v":"Fahrer Friedhelm Eickhorn mit der StartNr. 8 ,hat erfolgreich die Prüfung SP4 absolviert. Zeit: "},{"$f":"'SP4'!T10","v":"00:00:01.340"},{"$f":"'SP4'!V10","v":0}]
[{"$f":"'SP4'!I11","v":"15:23:30,00"},{"$f":"'SP4'!J11","v":"15:25:41,05"},{"$f":"'SP4'!K11","v":"00:02:11.050"},{"$f":"'SP4'!L11","v":"00:02:11.050"},{"$f":"'SP4'!M11","v":"00:00:01.050"},{"$f":"'SP4'!S11","v":"Fahrer Carsten Reblin mit der StartNr. 9 ,hat erfolgreich die Prüfung SP4 absolviert. Zeit: "},{"$f":"'SP4'!T11","v":"00:00:01.050"},{"$f":"'SP4'!V11","v":0}]
[{"$f":"'SP4'!I12","v":"15:24:00,00"},{"$f":"'SP4'!J12","v":"15:26:12,39"},{"$f":"'SP4'!K12","v":"00:02:12.390"},{"$f":"'SP4'!L12","v":"00:02:12.390"},{"$f":"'SP4'!M12","v":"00:00:02.390"},{"$f":"'SP4'!S12","v":"Fahrer Dieter Dinges mit der StartNr. 10 ,hat erfolgreich die Prüfung SP4 absolviert. Zeit: "},{"$f":"'SP4'!T12","v":"00:00:02.390"},{"$f":"'SP4'!V12","v":0}]
[{"$f":"'SP4'!I13","v":"15:25:00,00"},{"$f":"'SP4'!J13","v":"15:27:10,33"},{"$f":"'SP4'!K13","v":"00:02:10.330"},{"$f":"'SP4'!L13","v":"00:02:10.330"},{"$f":"'SP4'!M13","v":"00:00:00.330"},{"$f":"'SP4'!S13","v":"Fahrer Wolfgang Reeh mit der StartNr. 11 ,hat erfolgreich die Prüfung SP4 absolviert. Zeit: "},{"$f":"'SP4'!T13","v":"00:00:00.330"},{"$f":"'SP4'!V13","v":0}]
[{"$f":"'SP4'!I14","v":"15:25:30,00"},{"$f":"'SP4'!J14","v":"15:27:41,72"},{"$f":"'SP4'!K14","v":"00:02:11.720"},{"$f":"'SP4'!L14","v":"00:02:11.720"},{"$f":"'SP4'!M14","v":"00:00:01.720"},{"$f":"'SP4'!S14","v":"Fahrer Andreas Petry mit der StartNr. 12 ,hat erfolgreich die Prüfung SP4 absolviert. Zeit: "},{"$f":"'SP4'!T14","v":"00:00:01.720"},{"$f":"'SP4'!V14","v":"y"}]
[{"$f":"'SP4'!I15","v":"15:26:00,00"},{"$f":"'SP4'!J15","v":"15:28:10,17"},{"$f":"'SP4'!K15","v":"00:02:10.170"},{"$f":"'SP4'!L15","v":"00:02:10.170"},{"$f":"'SP4'!M15","v":"00:00:00.170"},{"$f":"'SP4'!S15","v":"Fahrer Ted Prenzel mit der StartNr. 13 ,hat erfolgreich die Prüfung SP4 absolviert. Zeit: "},{"$f":"'SP4'!T15","v":"00:00:00.170"},{"$f":"'SP4'!V15","v":0}]
[{"$f":"'SP4'!I16","v":""},{"$f":"'SP4'!J16","v":"15:30:46,37"},{"$f":"'SP4'!K16","v":""},{"$f":"'SP4'!L16","v":""},{"$f":"'SP4'!M16","v":{"$error":"#VALUE!"}},{"$f":"'SP4'!S16","v":""},{"$f":"'SP4'!T16","v":""},{"$f":"'SP4'!V16","v":0}]
[{"$f":"'SP4'!I17","v":""},{"$f":"'SP4'!J17","v":""},{"$f":"'SP4'!K17","v":""},{"$f":"'SP4'!L17","v":""},{"$f":"'SP4'!M17","v":{"$error":"#VALUE!"}},{"$f":"'SP4'!S17","v":""},{"$f":"'SP4'!T17","v":""},{"$f":"'SP4'!V17","v":0}]
[{"$f":"'SP4'!I18","v":""},{"$f":"'SP4'!J18","v":"15:28:40,66"},{"$f":"'SP4'!K18","v":""},{"$f":"'SP4'!L18","v":""},{"$f":"'SP4'!M18","v":{"$error":"#VALUE!"}},{"$f":"'SP4'!S18","v":""},{"$f":"'SP4'!T18","v":""},{"$f":"'SP4'!V18","v":0}]
[{"$f":"'SP4'!I19","v":""},{"$f":"'SP4'!J19","v":"15:29:10,66"},{"$f":"'SP4'!K19","v":""},{"$f":"'SP4'!L19","v":""},{"$f":"'SP4'!M19","v":{"$error":"#VALUE!"}},{"$f":"'SP4'!S19","v":""},{"$f":"'SP4'!T19","v":""},{"$f":"'SP4'!V19","v":0}]
[{"$f":"'SP4'!I20","v":""},{"$f":"'SP4'!J20","v":"16:47:10,29"},{"$f":"'SP4'!K20","v":""},{"$f":"'SP4'!L20","v":""},{"$f":"'SP4'!M20","v":{"$error":"#VALUE!"}},{"$f":"'SP4'!S20","v":""},{"$f":"'SP4'!T20","v":""},{"$f":"'SP4'!V20","v":0}]
[{"$f":"'SP4'!I21","v":""},{"$f":"'SP4'!J21","v":"15:31:10,55"},{"$f":"'SP4'!K21","v":""},{"$f":"'SP4'!L21","v":""},{"$f":"'SP4'!M21","v":{"$error":"#VALUE!"}},{"$f":"'SP4'!S21","v":""},{"$f":"'SP4'!T21","v":""},{"$f":"'SP4'!V21","v":0}]
[{"$f":"'SP4'!I22","v":""},{"$f":"'SP4'!J22","v":"15:32:10,85"},{"$f":"'SP4'!K22","v":""},{"$f":"'SP4'!L22","v":""},{"$f":"'SP4'!M22","v":{"$error":"#VALUE!"}},{"$f":"'SP4'!S22","v":""},{"$f":"'SP4'!T22","v":""},{"$f":"'SP4'!V22","v":0}]
[{"$f":"'SP4'!I23","v":""},{"$f":"'SP4'!J23","v":"15:33:11,15"},{"$f":"'SP4'!K23","v":""},{"$f":"'SP4'!L23","v":""},{"$f":"'SP4'!M23","v":{"$error":"#VALUE!"}},{"$f":"'SP4'!S23","v":""},{"$f":"'SP4'!T23","v":""},{"$f":"'SP4'!V23","v":0}]
[{"$f":"'SP4'!I24","v":"15:34:30,00"},{"$f":"'SP4'!J24","v":"15:37:19,79"},{"$f":"'SP4'!K24","v":"00:02:49.790"},{"$f":"'SP4'!L24","v":"00:02:49.790"},{"$f":"'SP4'!M24","v":"00:00:39.790"},{"$f":"'SP4'!S24","v":"Fahrer Ingo Winterstein mit der StartNr. 22 ,hat erfolgreich die Prüfung SP4 absolviert. Zeit: "},{"$f":"'SP4'!T24","v":"00:00:39.790"},{"$f":"'SP4'!V24","v":0}]
[{"$f":"'SP4'!I25","v":""},{"$f":"'SP4'!J25","v":"15:31:37,77"},{"$f":"'SP4'!K25","v":""},{"$f":"'SP4'!L25","v":""},{"$f":"'SP4'!M25","v":{"$error":"#VALUE!"}},{"$f":"'SP4'!S25","v":""},{"$f":"'SP4'!T25","v":""},{"$f":"'SP4'!V25","v":0}]
[{"$f":"'SP4'!I26","v":"16:19:00,00"},{"$f":"'SP4'!J26","v":""},{"$f":"'SP4'!K26","v":{"$error":"#VALUE!"}},{"$f":"'SP4'!L26","v":{"$error":"#VALUE!"}},{"$f":"'SP4'!M26","v":{"$error":"#VALUE!"}},{"$f":"'SP4'!S26","v":""},{"$f":"'SP4'!T26","v":""},{"$f":"'SP4'!V26","v":0}]
[{"$f":"'SP4'!I27","v":""},{"$f":"'SP4'!J27","v":"15:32:43,77"},{"$f":"'SP4'!K27","v":""},{"$f":"'SP4'!L27","v":""},{"$f":"'SP4'!M27","v":{"$error":"#VALUE!"}},{"$f":"'SP4'!S27","v":""},{"$f":"'SP4'!T27","v":""},{"$f":"'SP4'!V27","v":0}]
[{"$f":"'SP4'!I28","v":"15:39:00,00"},{"$f":"'SP4'!J28","v":"15:41:10,17"},{"$f":"'SP4'!K28","v":"00:02:10.170"},{"$f":"'SP4'!L28","v":"00:02:10.170"},{"$f":"'SP4'!M28","v":"00:00:00.170"},{"$f":"'SP4'!S28","v":"Fahrer Carolin Heusel mit der StartNr. 26 ,hat erfolgreich die Prüfung SP4 absolviert. Zeit: "},{"$f":"'SP4'!T28","v":"00:00:00.170"},{"$f":"'SP4'!V28","v":0}]
[{"$f":"'SP4'!I29","v":"15:36:00,00"},{"$f":"'SP4'!J29","v":"15:38:10,78"},{"$f":"'SP4'!K29","v":"00:02:10.780"},{"$f":"'SP4'!L29","v":"00:02:10.780"},{"$f":"'SP4'!M29","v":"00:00:00.780"},{"$f":"'SP4'!S29","v":"Fahrer Regina Philippi mit der StartNr. 27 ,hat erfolgreich die Prüfung SP4 absolviert. Zeit: "},{"$f":"'SP4'!T29","v":"00:00:00.780"},{"$f":"'SP4'!V29","v":0}]
[{"$f":"'SP4'!I30","v":""},{"$f":"'SP4'!J30","v":"15:33:40,01"},{"$f":"'SP4'!K30","v":""},{"$f":"'SP4'!L30","v":""},{"$f":"'SP4'!M30","v":{"$error":"#VALUE!"}},{"$f":"'SP4'!S30","v":""},{"$f":"'SP4'!T30","v":""},{"$f":"'SP4'!V30","v":0}]
[{"$f":"'SP4'!I31","v":"15:59:00,00"},{"$f":"'SP4'!J31","v":"16:01:11,02"},{"$f":"'SP4'!K31","v":"00:02:11.020"},{"$f":"'SP4'!L31","v":"00:02:11.020"},{"$f":"'SP4'!M31","v":"00:00:01.020"},{"$f":"'SP4'!S31","v":"Fahrer Dennis Weiss mit der StartNr. 29 ,hat erfolgreich die Prüfung SP4 absolviert. Zeit: "},{"$f":"'SP4'!T31","v":"00:00:01.020"},{"$f":"'SP4'!V31","v":0}]
[{"$f":"'SP4'!I32","v":"15:53:00,00"},{"$f":"'SP4'!J32","v":"15:55:10,31"},{"$f":"'SP4'!K32","v":"00:02:10.310"},{"$f":"'SP4'!L32","v":"00:02:10.310"},{"$f":"'SP4'!M32","v":"00:00:00.310"},{"$f":"'SP4'!S32","v":"Fahrer Harald Hamprecht mit der StartNr. 30 ,hat erfolgreich die Prüfung SP4 absolviert. Zeit: "},{"$f":"'SP4'!T32","v":"00:00:00.310"},{"$f":"'SP4'!V32","v":0}]
[{"$f":"'SP4'!I33","v":""},{"$f":"'SP4'!J33","v":"15:34:02,84"},{"$f":"'SP4'!K33","v":""},{"$f":"'SP4'!L33","v":""},{"$f":"'SP4'!M33","v":{"$error":"#VALUE!"}},{"$f":"'SP4'!S33","v":""},{"$f":"'SP4'!T33","v":""},{"$f":"'SP4'!V33","v":0}]
[{"$f":"'SP4'!I34","v":""},{"$f":"'SP4'!J34","v":"15:37:13,35"},{"$f":"'SP4'!K34","v":""},{"$f":"'SP4'!L34","v":""},{"$f":"'SP4'!M34","v":{"$error":"#VALUE!"}},{"$f":"'SP4'!S34","v":""},{"$f":"'SP4'!T34","v":""},{"$f":"'SP4'!V34","v":0}]
[{"$f":"'SP4'!I35","v":"15:33:30,00"},{"$f":"'SP4'!J35","v":"15:35:44,81"},{"$f":"'SP4'!K35","v":"00:02:14.810"},{"$f":"'SP4'!L35","v":"00:02:14.810"},{"$f":"'SP4'!M35","v":"00:00:04.810"},{"$f":"'SP4'!S35","v":"Fahrer Konstantin Kovarbasic mit der StartNr. 33 ,hat erfolgreich die Prüfung SP4 absolviert. Zeit: "},{"$f":"'SP4'!T35","v":"00:00:04.810"},{"$f":"'SP4'!V35","v":0}]
[{"$f":"'SP4'!I36","v":"15:40:00,00"},{"$f":"'SP4'!J36","v":"15:42:11,68"},{"$f":"'SP4'!K36","v":"00:02:11.680"},{"$f":"'SP4'!L36","v":"00:02:11.680"},{"$f":"'SP4'!M36","v":"00:00:01.680"},{"$f":"'SP4'!S36","v":"Fahrer Nikolaus Kratz mit der StartNr. 34 ,hat erfolgreich die Prüfung SP4 absolviert. Zeit: "},{"$f":"'SP4'!T36","v":"00:00:01.680"},{"$f":"'SP4'!V36","v":0}]
[{"$f":"'SP4'!I37","v":"15:41:00,00"},{"$f":"'SP4'!J37","v":"15:43:10,71"},{"$f":"'SP4'!K37","v":"00:02:10.710"},{"$f":"'SP4'!L37","v":"00:02:10.710"},{"$f":"'SP4'!M37","v":"00:00:00.710"},{"$f":"'SP4'!S37","v":"Fahrer Andreas Eberhardt mit der StartNr. 35 ,hat erfolgreich die Prüfung SP4 absolviert. Zeit: "},{"$f":"'SP4'!T37","v":"00:00:00.710"},{"$f":"'SP4'!V37","v":0}]
[{"$f":"'SP4'!I38","v":"15:34:00,00"},{"$f":"'SP4'!J38","v":"15:36:15,04"},{"$f":"'SP4'!K38","v":"00:02:15.040"},{"$f":"'SP4'!L38","v":"00:02:15.040"},{"$f":"'SP4'!M38","v":"00:00:05.040"},{"$f":"'SP4'!S38","v":"Fahrer Gerhard Thomas mit der StartNr. 36 ,hat erfolgreich die Prüfung SP4 absolviert. Zeit: "},{"$f":"'SP4'!T38","v":"00:00:05.040"},{"$f":"'SP4'!V38","v":0}]
[{"$f":"'SP4'!I39","v":""},{"$f":"'SP4'!J39","v":"15:35:10,24"},{"$f":"'SP4'!K39","v":""},{"$f":"'SP4'!L39","v":""},{"$f":"'SP4'!M39","v":{"$error":"#VALUE!"}},{"$f":"'SP4'!S39","v":""},{"$f":"'SP4'!T39","v":""},{"$f":"'SP4'!V39","v":0}]
[{"$f":"'SP4'!I40","v":""},{"$f":"'SP4'!J40","v":""},{"$f":"'SP4'!K40","v":""},{"$f":"'SP4'!L40","v":""},{"$f":"'SP4'!M40","v":{"$error":"#VALUE!"}},{"$f":"'SP4'!S40","v":""},{"$f":"'SP4'!T40","v":""},{"$f":"'SP4'!V40","v":0}]
[{"$f":"'SP4'!I41","v":"15:35:30,00"},{"$f":"'SP4'!J41","v":"15:37:39,68"},{"$f":"'SP4'!K41","v":"00:02:09.680"},{"$f":"'SP4'!L41","v":"00:02:09.680"},{"$f":"'SP4'!M41","v":"00:00:00.320"},{"$f":"'SP4'!S41","v":"Fahrer Sascha Wilkesmann mit der StartNr. 39 ,hat erfolgreich die Prüfung SP4 absolviert. Zeit: -"},{"$f":"'SP4'!T41","v":"00:00:00.320"},{"$f":"'SP4'!V41","v":0}]
[{"$f":"'SP4'!I42","v":"15:58:00,00"},{"$f":"'SP4'!J42","v":"16:00:33,72"},{"$f":"'SP4'!K42","v":"00:02:33.720"},{"$f":"'SP4'!L42","v":"00:02:33.720"},{"$f":"'SP4'!M42","v":"00:00:23.720"},{"$f":"'SP4'!S42","v":"Fahrer Gregor Schulz mit der StartNr. 40 ,hat erfolgreich die Prüfung SP4 absolviert. Zeit: "},{"$f":"'SP4'!T42","v":"00:00:23.720"},{"$f":"'SP4'!V42","v":0}]
[{"$f":"'SP4'!I43","v":""},{"$f":"'SP4'!J43","v":"15:34:39,05"},{"$f":"'SP4'!K43","v":""},{"$f":"'SP4'!L43","v":""},{"$f":"'SP4'!M43","v":{"$error":"#VALUE!"}},{"$f":"'SP4'!S43","v":""},{"$f":"'SP4'!T43","v":""},{"$f":"'SP4'!V43","v":0}]
[{"$f":"'SP4'!I44","v":""},{"$f":"'SP4'!J44","v":""},{"$f":"'SP4'!K44","v":""},{"$f":"'SP4'!L44","v":""},{"$f":"'SP4'!M44","v":{"$error":"#VALUE!"}},{"$f":"'SP4'!S44","v":""},{"$f":"'SP4'!T44","v":""},{"$f":"'SP4'!V44","v":0}]
[{"$f":"'SP4'!I45","v":""},{"$f":"'SP4'!J45","v":""},{"$f":"'SP4'!K45","v":""},{"$f":"'SP4'!L45","v":""},{"$f":"'SP4'!M45","v":{"$error":"#VALUE!"}},{"$f":"'SP4'!S45","v":""},{"$f":"'SP4'!T45","v":""},{"$f":"'SP4'!V45","v":0}]
[{"$f":"'SP4'!I46","v":"15:51:00,00"},{"$f":"'SP4'!J46","v":"15:52:56,80"},{"$f":"'SP4'!K46","v":"00:01:56.800"},{"$f":"'SP4'!L46","v":"00:01:56.800"},{"$f":"'SP4'!M46","v":"00:00:13.200"},{"$f":"'SP4'!S46","v":"Fahrer Jean-Philippe Kempf mit der StartNr. 44 ,hat erfolgreich die Prüfung SP4 absolviert. Zeit: -"},{"$f":"'SP4'!T46","v":"00:00:13.200"},{"$f":"'SP4'!V46","v":0}]
[{"$f":"'SP4'!I47","v":"15:43:00,00"},{"$f":"'SP4'!J47","v":"15:45:21,85"},{"$f":"'SP4'!K47","v":"00:02:21.850"},{"$f":"'SP4'!L47","v":"00:02:21.850"},{"$f":"'SP4'!M47","v":"00:00:11.850"},{"$f":"'SP4'!S47","v":"Fahrer Daniel Martin mit der StartNr. 45 ,hat erfolgreich die Prüfung SP4 absolviert. Zeit: "},{"$f":"'SP4'!T47","v":"00:00:11.850"},{"$f":"'SP4'!V47","v":0}]
[{"$f":"'SP4'!I48","v":"16:34:00,00"},{"$f":"'SP4'!J48","v":"16:36:09,33"},{"$f":"'SP4'!K48","v":"00:02:09.330"},{"$f":"'SP4'!L48","v":"00:02:09.330"},{"$f":"'SP4'!M48","v":"00:00:00.670"},{"$f":"'SP4'!S48","v":"Fahrer Elena Funk mit der StartNr. 46 ,hat erfolgreich die Prüfung SP4 absolviert. Zeit: -"},{"$f":"'SP4'!T48","v":"00:00:00.670"},{"$f":"'SP4'!V48","v":0}]
[{"$f":"'SP4'!I49","v":"15:42:00,00"},{"$f":"'SP4'!J49","v":"15:44:10,40"},{"$f":"'SP4'!K49","v":"00:02:10.400"},{"$f":"'SP4'!L49","v":"00:02:10.400"},{"$f":"'SP4'!M49","v":"00:00:00.400"},{"$f":"'SP4'!S49","v":"Fahrer Hans Mutschall mit der StartNr. 47 ,hat erfolgreich die Prüfung SP4 absolviert. Zeit: "},{"$f":"'SP4'!T49","v":"00:00:00.400"},{"$f":"'SP4'!V49","v":0}]
[{"$f":"'SP4'!I50","v":"15:38:00,00"},{"$f":"'SP4'!J50","v":"15:40:11,21"},{"$f":"'SP4'!K50","v":"00:02:11.210"},{"$f":"'SP4'!L50","v":"00:02:11.210"},{"$f":"'SP4'!M50","v":"00:00:01.210"},{"$f":"'SP4'!S50","v":"Fahrer Kahled Rahman mit der StartNr. 48 ,hat erfolgreich die Prüfung SP4 absolviert. Zeit: "},{"$f":"'SP4'!T50","v":"00:00:01.210"},{"$f":"'SP4'!V50","v":0}]
[{"$f":"'SP4'!I51","v":"15:47:00,00"},{"$f":"'SP4'!J51","v":"15:49:10,37"},{"$f":"'SP4'!K51","v":"00:02:10.370"},{"$f":"'SP4'!L51","v":"00:02:10.370"},{"$f":"'SP4'!M51","v":"00:00:00.370"},{"$f":"'SP4'!S51","v":"Fahrer Jochen Schwarz mit der StartNr. 49 ,hat erfolgreich die Prüfung SP4 absolviert. Zeit: "},{"$f":"'SP4'!T51","v":"00:00:00.370"},{"$f":"'SP4'!V51","v":0}]
[{"$f":"'SP4'!I52","v":""},{"$f":"'SP4'!J52","v":""},{"$f":"'SP4'!K52","v":""},{"$f":"'SP4'!L52","v":""},{"$f":"'SP4'!M52","v":{"$error":"#VALUE!"}},{"$f":"'SP4'!S52","v":""},{"$f":"'SP4'!T52","v":""},{"$f":"'SP4'!V52","v":0}]
[{"$f":"'SP4'!I53","v":"15:50:00,00"},{"$f":"'SP4'!J53","v":""},{"$f":"'SP4'!K53","v":{"$error":"#VALUE!"}},{"$f":"'SP4'!L53","v":{"$error":"#VALUE!"}},{"$f":"'SP4'!M53","v":{"$error":"#VALUE!"}},{"$f":"'SP4'!S53","v":""},{"$f":"'SP4'!T53","v":""},{"$f":"'SP4'!V53","v":0}]
[{"$f":"'SP4'!I54","v":"15:54:00,00"},{"$f":"'SP4'!J54","v":"15:56:07,52"},{"$f":"'SP4'!K54","v":"00:02:07.520"},{"$f":"'SP4'!L54","v":"00:02:07.520"},{"$f":"'SP4'!M54","v":"00:00:02.480"},{"$f":"'SP4'!S54","v":"Fahrer Harald König mit der StartNr. 52 ,hat erfolgreich die Prüfung SP4 absolviert. Zeit: -"},{"$f":"'SP4'!T54","v":"00:00:02.480"},{"$f":"'SP4'!V54","v":0}]
[{"$f":"'SP4'!I55","v":"15:49:00,00"},{"$f":"'SP4'!J55","v":"15:51:09,98"},{"$f":"'SP4'!K55","v":"00:02:09.980"},{"$f":"'SP4'!L55","v":"00:02:09.980"},{"$f":"'SP4'!M55","v":"00:00:00.020"},{"$f":"'SP4'!S55","v":"Fahrer Thomas Blank mit der StartNr. 53 ,hat erfolgreich die Prüfung SP4 absolviert. Zeit: -"},{"$f":"'SP4'!T55","v":"00:00:00.020"},{"$f":"'SP4'!V55","v":0}]
[{"$f":"'SP4'!I56","v":"16:09:00,00"},{"$f":"'SP4'!J56","v":"16:11:16,43"},{"$f":"'SP4'!K56","v":"00:02:16.430"},{"$f":"'SP4'!L56","v":"00:02:16.430"},{"$f":"'SP4'!M56","v":"00:00:06.430"},{"$f":"'SP4'!S56","v":"Fahrer Heidi Eberhardt mit der StartNr. 54 ,hat erfolgreich die Prüfung SP4 absolviert. Zeit: "},{"$f":"'SP4'!T56","v":"00:00:06.430"},{"$f":"'SP4'!V56","v":0}]
[{"$f":"'SP4'!I57","v":"16:08:00,00"},{"$f":"'SP4'!J57","v":"16:10:09,83"},{"$f":"'SP4'!K57","v":"00:02:09.830"},{"$f":"'SP4'!L57","v":"00:02:09.830"},{"$f":"'SP4'!M57","v":"00:00:00.170"},{"$f":"'SP4'!S57","v":"Fahrer Karina Ansos mit der StartNr. 55 ,hat erfolgreich die Prüfung SP4 absolviert. Zeit: -"},{"$f":"'SP4'!T57","v":"00:00:00.170"},{"$f":"'SP4'!V57","v":0}]
[{"$f":"'SP4'!I58","v":"15:44:00,00"},{"$f":"'SP4'!J58","v":"15:46:11,23"},{"$f":"'SP4'!K58","v":"00:02:11.230"},{"$f":"'SP4'!L58","v":"00:02:11.230"},{"$f":"'SP4'!M58","v":"00:00:01.230"},{"$f":"'SP4'!S58","v":"Fahrer Michael Gotta mit der StartNr. 56 ,hat erfolgreich die Prüfung SP4 absolviert. Zeit: "},{"$f":"'SP4'!T58","v":"00:00:01.230"},{"$f":"'SP4'!V58","v":0}]
[{"$f":"'SP4'!I59","v":"16:13:00,00"},{"$f":"'SP4'!J59","v":"16:15:10.460"},{"$f":"'SP4'!K59","v":"00:02:10.460"},{"$f":"'SP4'!L59","v":"00:02:10.460"},{"$f":"'SP4'!M59","v":"00:00:00.460"},{"$f":"'SP4'!S59","v":"Fahrer Stefanie Rinck mit der StartNr. 57 ,hat erfolgreich die Prüfung SP4 absolviert. Zeit: "},{"$f":"'SP4'!T59","v":"00:00:00.460"},{"$f":"'SP4'!V59","v":0}]
[{"$f":"'SP4'!I60","v":"15:57:00,00"},{"$f":"'SP4'!J60","v":"15:59:52,11"},{"$f":"'SP4'!K60","v":"00:02:52.110"},{"$f":"'SP4'!L60","v":"00:02:52.110"},{"$f":"'SP4'!M60","v":"00:00:42.110"},{"$f":"'SP4'!S60","v":"Fahrer Armin Slotta mit der StartNr. 58 ,hat erfolgreich die Prüfung SP4 absolviert. Zeit: "},{"$f":"'SP4'!T60","v":"00:00:42.110"},{"$f":"'SP4'!V60","v":0}]
[{"$f":"'SP4'!I61","v":"16:24:00,00"},{"$f":"'SP4'!J61","v":"16:26:09,64"},{"$f":"'SP4'!K61","v":"00:02:09.640"},{"$f":"'SP4'!L61","v":"00:02:09.640"},{"$f":"'SP4'!M61","v":"00:00:00.360"},{"$f":"'SP4'!S61","v":"Fahrer Julia Kende mit der StartNr. 59 ,hat erfolgreich die Prüfung SP4 absolviert. Zeit: -"},{"$f":"'SP4'!T61","v":"00:00:00.360"},{"$f":"'SP4'!V61","v":0}]
[{"$f":"'SP4'!I62","v":"15:55:00,00"},{"$f":"'SP4'!J62","v":"15:57:08,69"},{"$f":"'SP4'!K62","v":"00:02:08.690"},{"$f":"'SP4'!L62","v":"00:02:08.690"},{"$f":"'SP4'!M62","v":"00:00:01.310"},{"$f":"'SP4'!S62","v":"Fahrer Robert Bleckmann mit der StartNr. 60 ,hat erfolgreich die Prüfung SP4 absolviert. Zeit: -"},{"$f":"'SP4'!T62","v":"00:00:01.310"},{"$f":"'SP4'!V62","v":0}]
[{"$f":"'SP4'!I63","v":"15:52:00,00"},{"$f":"'SP4'!J63","v":"15:54:09,13"},{"$f":"'SP4'!K63","v":"00:02:09.130"},{"$f":"'SP4'!L63","v":"00:02:09.130"},{"$f":"'SP4'!M63","v":"00:00:00.870"},{"$f":"'SP4'!S63","v":"Fahrer Christof Harwardt mit der StartNr. 61 ,hat erfolgreich die Prüfung SP4 absolviert. Zeit: -"},{"$f":"'SP4'!T63","v":"00:00:00.870"},{"$f":"'SP4'!V63","v":0}]
[{"$f":"'SP4'!I64","v":"16:23:00,00"},{"$f":"'SP4'!J64","v":"16:25:00,82"},{"$f":"'SP4'!K64","v":"00:02:00.820"},{"$f":"'SP4'!L64","v":"00:02:00.820"},{"$f":"'SP4'!M64","v":"00:00:09.180"},{"$f":"'SP4'!S64","v":"Fahrer Thomas Kahns mit der StartNr. 62 ,hat erfolgreich die Prüfung SP4 absolviert. Zeit: -"},{"$f":"'SP4'!T64","v":"00:00:09.180"},{"$f":"'SP4'!V64","v":0}]
[{"$f":"'SP4'!I65","v":"15:46:00,00"},{"$f":"'SP4'!J65","v":"15:47:42,15"},{"$f":"'SP4'!K65","v":"00:01:42.150"},{"$f":"'SP4'!L65","v":"00:01:42.150"},{"$f":"'SP4'!M65","v":"00:00:27.850"},{"$f":"'SP4'!S65","v":"Fahrer Maximilian Herbst mit der StartNr. 63 ,hat erfolgreich die Prüfung SP4 absolviert. Zeit: -"},{"$f":"'SP4'!T65","v":"00:00:27.850"},{"$f":"'SP4'!V65","v":0}]
[{"$f":"'SP4'!I66","v":"16:16:00,00"},{"$f":"'SP4'!J66","v":"16:17:40,26"},{"$f":"'SP4'!K66","v":"00:01:40.260"},{"$f":"'SP4'!L66","v":"00:01:40.260"},{"$f":"'SP4'!M66","v":"00:00:29.740"},{"$f":"'SP4'!S66","v":"Fahrer Jürgen Buchhold mit der StartNr. 64 ,hat erfolgreich die Prüfung SP4 absolviert. Zeit: -"},{"$f":"'SP4'!T66","v":"00:00:29.740"},{"$f":"'SP4'!V66","v":0}]
[{"$f":"'SP4'!I67","v":""},{"$f":"'SP4'!J67","v":""},{"$f":"'SP4'!K67","v":""},{"$f":"'SP4'!L67","v":""},{"$f":"'SP4'!M67","v":{"$error":"#VALUE!"}},{"$f":"'SP4'!S67","v":""},{"$f":"'SP4'!T67","v":""},{"$f":"'SP4'!V67","v":0}]
[{"$f":"'SP4'!I68","v":"16:06:00,00"},{"$f":"'SP4'!J68","v":"16:07:50,48"},{"$f":"'SP4'!K68","v":"00:01:50.480"},{"$f":"'SP4'!L68","v":"00:01:50.480"},{"$f":"'SP4'!M68","v":"00:00:19.520"},{"$f":"'SP4'!S68","v":"Fahrer Peter Bel mit der StartNr. 66 ,hat erfolgreich die Prüfung SP4 absolviert. Zeit: -"},{"$f":"'SP4'!T68","v":"00:00:19.520"},{"$f":"'SP4'!V68","v":0}]
[{"$f":"'SP4'!I69","v":"16:05:00,00"},{"$f":"'SP4'!J69","v":"16:07:11,13"},{"$f":"'SP4'!K69","v":"00:02:11.130"},{"$f":"'SP4'!L69","v":"00:02:11.130"},{"$f":"'SP4'!M69","v":"00:00:01.130"},{"$f":"'SP4'!S69","v":"Fahrer Thomas Mirau mit der StartNr. 67 ,hat erfolgreich die Prüfung SP4 absolviert. Zeit: "},{"$f":"'SP4'!T69","v":"00:00:01.130"},{"$f":"'SP4'!V69","v":0}]
[{"$f":"'SP4'!I70","v":"15:45:00,00"},{"$f":"'SP4'!J70","v":"15:47:09,05"},{"$f":"'SP4'!K70","v":"00:02:09.050"},{"$f":"'SP4'!L70","v":"00:02:09.050"},{"$f":"'SP4'!M70","v":"00:00:00.950"},{"$f":"'SP4'!S70","v":"Fahrer Markus Gotta mit der StartNr. 68 ,hat erfolgreich die Prüfung SP4 absolviert. Zeit: -"},{"$f":"'SP4'!T70","v":"00:00:00.950"},{"$f":"'SP4'!V70","v":0}]
[{"$f":"'SP4'!I71","v":"16:15:00,00"},{"$f":"'SP4'!J71","v":"16:17:10,45"},{"$f":"'SP4'!K71","v":"00:02:10.450"},{"$f":"'SP4'!L71","v":"00:02:10.450"},{"$f":"'SP4'!M71","v":"00:00:00.450"},{"$f":"'SP4'!S71","v":"Fahrer Robin Keulertz mit der StartNr. 69 ,hat erfolgreich die Prüfung SP4 absolviert. Zeit: "},{"$f":"'SP4'!T71","v":"00:00:00.450"},{"$f":"'SP4'!V71","v":0}]
[{"$f":"'SP4'!I72","v":""},{"$f":"'SP4'!J72","v":""},{"$f":"'SP4'!K72","v":""},{"$f":"'SP4'!L72","v":""},{"$f":"'SP4'!M72","v":{"$error":"#VALUE!"}},{"$f":"'SP4'!S72","v":""},{"$f":"'SP4'!T72","v":""},{"$f":"'SP4'!V72","v":0}]
[{"$f":"'SP4'!I73","v":"16:00:00,00"},{"$f":"'SP4'!J73","v":"16:02:09.500"},{"$f":"'SP4'!K73","v":"00:02:09.500"},{"$f":"'SP4'!L73","v":"00:02:09.500"},{"$f":"'SP4'!M73","v":"00:00:00.500"},{"$f":"'SP4'!S73","v":"Fahrer Ingolf Zschockelt mit der StartNr. 71 ,hat erfolgreich die Prüfung SP4 absolviert. Zeit: -"},{"$f":"'SP4'!T73","v":"00:00:00.500"},{"$f":"'SP4'!V73","v":0}]
[{"$f":"'SP4'!I74","v":""},{"$f":"'SP4'!J74","v":""},{"$f":"'SP4'!K74","v":""},{"$f":"'SP4'!L74","v":""},{"$f":"'SP4'!M74","v":{"$error":"#VALUE!"}},{"$f":"'SP4'!S74","v":""},{"$f":"'SP4'!T74","v":""},{"$f":"'SP4'!V74","v":0}]
[{"$f":"'SP4'!I75","v":"16:17:00,00"},{"$f":"'SP4'!J75","v":"16:19:23,60"},{"$f":"'SP4'!K75","v":"00:02:23.600"},{"$f":"'SP4'!L75","v":"00:02:23.600"},{"$f":"'SP4'!M75","v":"00:00:13.600"},{"$f":"'SP4'!S75","v":"Fahrer Ramona Wagner mit der StartNr. 73 ,hat erfolgreich die Prüfung SP4 absolviert. Zeit: "},{"$f":"'SP4'!T75","v":"00:00:13.600"},{"$f":"'SP4'!V75","v":0}]
[{"$f":"'SP4'!I76","v":""},{"$f":"'SP4'!J76","v":"16:38:08,84"},{"$f":"'SP4'!K76","v":""},{"$f":"'SP4'!L76","v":""},{"$f":"'SP4'!M76","v":{"$error":"#VALUE!"}},{"$f":"'SP4'!S76","v":""},{"$f":"'SP4'!T76","v":""},{"$f":"'SP4'!V76","v":0}]
[{"$f":"'SP4'!I77","v":"15:56:00,00"},{"$f":"'SP4'!J77","v":"15:58:10,55"},{"$f":"'SP4'!K77","v":"00:02:10.550"},{"$f":"'SP4'!L77","v":"00:02:10.550"},{"$f":"'SP4'!M77","v":"00:00:00.550"},{"$f":"'SP4'!S77","v":"Fahrer Frank Hoefnagels mit der StartNr. 75 ,hat erfolgreich die Prüfung SP4 absolviert. Zeit: "},{"$f":"'SP4'!T77","v":"00:00:00.550"},{"$f":"'SP4'!V77","v":0}]
[{"$f":"'SP4'!I78","v":"16:02:00,00"},{"$f":"'SP4'!J78","v":"16:04:09,03"},{"$f":"'SP4'!K78","v":"00:02:09.030"},{"$f":"'SP4'!L78","v":"00:02:09.030"},{"$f":"'SP4'!M78","v":"00:00:00.970"},{"$f":"'SP4'!S78","v":"Fahrer Michael Karch mit der StartNr. 76 ,hat erfolgreich die Prüfung SP4 absolviert. Zeit: -"},{"$f":"'SP4'!T78","v":"00:00:00.970"},{"$f":"'SP4'!V78","v":0}]
[{"$f":"'SP4'!I79","v":"16:18:00,00"},{"$f":"'SP4'!J79","v":"16:20:10,06"},{"$f":"'SP4'!K79","v":"00:02:10.060"},{"$f":"'SP4'!L79","v":"00:02:10.060"},{"$f":"'SP4'!M79","v":"00:00:00.060"},{"$f":"'SP4'!S79","v":"Fahrer Dirk Götze mit der StartNr. 77 ,hat erfolgreich die Prüfung SP4 absolviert. Zeit: "},{"$f":"'SP4'!T79","v":"00:00:00.060"},{"$f":"'SP4'!V79","v":0}]
[{"$f":"'SP4'!I80","v":"16:21:00,00"},{"$f":"'SP4'!J80","v":"16:23:11,28"},{"$f":"'SP4'!K80","v":"00:02:11.280"},{"$f":"'SP4'!L80","v":"00:02:11.280"},{"$f":"'SP4'!M80","v":"00:00:01.280"},{"$f":"'SP4'!S80","v":"Fahrer Stefan Hillers mit der StartNr. 78 ,hat erfolgreich die Prüfung SP4 absolviert. Zeit: "},{"$f":"'SP4'!T80","v":"00:00:01.280"},{"$f":"'SP4'!V80","v":0}]
[{"$f":"'SP4'!I81","v":"16:04:00,00"},{"$f":"'SP4'!J81","v":"16:06:11.440"},{"$f":"'SP4'!K81","v":"00:02:11.440"},{"$f":"'SP4'!L81","v":"00:02:11.440"},{"$f":"'SP4'!M81","v":"00:00:01.440"},{"$f":"'SP4'!S81","v":"Fahrer Christian Rafflenbeul mit der StartNr. 79 ,hat erfolgreich die Prüfung SP4 absolviert. Zeit: "},{"$f":"'SP4'!T81","v":"00:00:01.440"},{"$f":"'SP4'!V81","v":0}]
[{"$f":"'SP4'!I82","v":"16:12:30,00"},{"$f":"'SP4'!J82","v":"16:14:37,93"},{"$f":"'SP4'!K82","v":"00:02:07.930"},{"$f":"'SP4'!L82","v":"00:02:07.930"},{"$f":"'SP4'!M82","v":"00:00:02.070"},{"$f":"'SP4'!S82","v":"Fahrer Gerhard Reuschel mit der StartNr. 80 ,hat erfolgreich die Prüfung SP4 absolviert. Zeit: -"},{"$f":"'SP4'!T82","v":"00:00:02.070"},{"$f":"'SP4'!V82","v":0}]
[{"$f":"'SP4'!I83","v":"16:14:00,00"},{"$f":"'SP4'!J83","v":"16:16:10,57"},{"$f":"'SP4'!K83","v":"00:02:10.570"},{"$f":"'SP4'!L83","v":"00:02:10.570"},{"$f":"'SP4'!M83","v":"00:00:00.570"},{"$f":"'SP4'!S83","v":"Fahrer Karsten Rachow mit der StartNr. 81 ,hat erfolgreich die Prüfung SP4 absolviert. Zeit: "},{"$f":"'SP4'!T83","v":"00:00:00.570"},{"$f":"'SP4'!V83","v":0}]
[{"$f":"'SP4'!I84","v":""},{"$f":"'SP4'!J84","v":""},{"$f":"'SP4'!K84","v":""},{"$f":"'SP4'!L84","v":""},{"$f":"'SP4'!M84","v":{"$error":"#VALUE!"}},{"$f":"'SP4'!S84","v":""},{"$f":"'SP4'!T84","v":""},{"$f":"'SP4'!V84","v":0}]
[{"$f":"'SP4'!I85","v":"16:13:30,00"},{"$f":"'SP4'!J85","v":"16:15:36,50"},{"$f":"'SP4'!K85","v":"00:02:06.500"},{"$f":"'SP4'!L85","v":"00:02:06.500"},{"$f":"'SP4'!M85","v":"00:00:03.500"},{"$f":"'SP4'!S85","v":"Fahrer Alexander Weil mit der StartNr. 83 ,hat erfolgreich die Prüfung SP4 absolviert. Zeit: -"},{"$f":"'SP4'!T85","v":"00:00:03.500"},{"$f":"'SP4'!V85","v":0}]
[{"$f":"'SP4'!I86","v":"16:32:00,00"},{"$f":"'SP4'!J86","v":"16:34:09,27"},{"$f":"'SP4'!K86","v":"00:02:09.270"},{"$f":"'SP4'!L86","v":"00:02:09.270"},{"$f":"'SP4'!M86","v":"00:00:00.730"},{"$f":"'SP4'!S86","v":"Fahrer Josef Lindenberger mit der StartNr. 84 ,hat erfolgreich die Prüfung SP4 absolviert. Zeit: -"},{"$f":"'SP4'!T86","v":"00:00:00.730"},{"$f":"'SP4'!V86","v":0}]
[{"$f":"'SP4'!I87","v":"16:11:30,00"},{"$f":"'SP4'!J87","v":"16:13:16,66"},{"$f":"'SP4'!K87","v":"00:01:46.660"},{"$f":"'SP4'!L87","v":"00:01:46.660"},{"$f":"'SP4'!M87","v":"00:00:23.340"},{"$f":"'SP4'!S87","v":"Fahrer Rick Durante mit der StartNr. 85 ,hat erfolgreich die Prüfung SP4 absolviert. Zeit: -"},{"$f":"'SP4'!T87","v":"00:00:23.340"},{"$f":"'SP4'!V87","v":0}]
[{"$f":"'SP4'!I88","v":"16:10:00,00"},{"$f":"'SP4'!J88","v":"16:12:09,49"},{"$f":"'SP4'!K88","v":"00:02:09.490"},{"$f":"'SP4'!L88","v":"00:02:09.490"},{"$f":"'SP4'!M88","v":"00:00:00.510"},{"$f":"'SP4'!S88","v":"Fahrer Almuth Siemann mit der StartNr. 86 ,hat erfolgreich die Prüfung SP4 absolviert. Zeit: -"},{"$f":"'SP4'!T88","v":"00:00:00.510"},{"$f":"'SP4'!V88","v":0}]
[{"$f":"'SP4'!I89","v":"16:31:00,00"},{"$f":"'SP4'!J89","v":"16:33:10,10"},{"$f":"'SP4'!K89","v":"00:02:10.100"},{"$f":"'SP4'!L89","v":"00:02:10.100"},{"$f":"'SP4'!M89","v":"00:00:00.100"},{"$f":"'SP4'!S89","v":"Fahrer Axel Strigl mit der StartNr. 87 ,hat erfolgreich die Prüfung SP4 absolviert. Zeit: "},{"$f":"'SP4'!T89","v":"00:00:00.100"},{"$f":"'SP4'!V89","v":0}]
[{"$f":"'SP4'!I90","v":"15:48:00,00"},{"$f":"'SP4'!J90","v":"15:50:10,18"},{"$f":"'SP4'!K90","v":"00:02:10.180"},{"$f":"'SP4'!L90","v":"00:02:10.180"},{"$f":"'SP4'!M90","v":"00:00:00.180"},{"$f":"'SP4'!S90","v":"Fahrer Philip Sommer mit der StartNr. 88 ,hat erfolgreich die Prüfung SP4 absolviert. Zeit: "},{"$f":"'SP4'!T90","v":"00:00:00.180"},{"$f":"'SP4'!V90","v":0}]
[{"$f":"'SP4'!I91","v":"16:30:00,00"},{"$f":"'SP4'!J91","v":"16:33:17,54"},{"$f":"'SP4'!K91","v":"00:03:17.540"},{"$f":"'SP4'!L91","v":"00:03:17.540"},{"$f":"'SP4'!M91","v":"00:01:07.540"},{"$f":"'SP4'!S91","v":"Fahrer Jörg Diehl mit der StartNr. 89 ,hat erfolgreich die Prüfung SP4 absolviert. Zeit: "},{"$f":"'SP4'!T91","v":"00:01:07.540"},{"$f":"'SP4'!V91","v":0}]
[{"$f":"'SP4'!I92","v":"16:26:00,00"},{"$f":"'SP4'!J92","v":"16:28:10,73"},{"$f":"'SP4'!K92","v":"00:02:10.730"},{"$f":"'SP4'!L92","v":"00:02:10.730"},{"$f":"'SP4'!M92","v":"00:00:00.730"},{"$f":"'SP4'!S92","v":"Fahrer Matthias Herzig mit der StartNr. 90 ,hat erfolgreich die Prüfung SP4 absolviert. Zeit: "},{"$f":"'SP4'!T92","v":"00:00:00.730"},{"$f":"'SP4'!V92","v":0}]
[{"$f":"'SP4'!I93","v":"16:07:00,00"},{"$f":"'SP4'!J93","v":"16:09:10,85"},{"$f":"'SP4'!K93","v":"00:02:10.850"},{"$f":"'SP4'!L93","v":"00:02:10.850"},{"$f":"'SP4'!M93","v":"00:00:00.850"},{"$f":"'SP4'!S93","v":"Fahrer Christoph Pasternak mit der StartNr. 91 ,hat erfolgreich die Prüfung SP4 absolviert. Zeit: "},{"$f":"'SP4'!T93","v":"00:00:00.850"},{"$f":"'SP4'!V93","v":0}]
[{"$f":"'SP4'!I94","v":"16:22:00,00"},{"$f":"'SP4'!J94","v":"16:24:10,51"},{"$f":"'SP4'!K94","v":"00:02:10.510"},{"$f":"'SP4'!L94","v":"00:02:10.510"},{"$f":"'SP4'!M94","v":"00:00:00.510"},{"$f":"'SP4'!S94","v":"Fahrer Lothar Schupet mit der StartNr. 92 ,hat erfolgreich die Prüfung SP4 absolviert. Zeit: "},{"$f":"'SP4'!T94","v":"00:00:00.510"},{"$f":"'SP4'!V94","v":0}]
[{"$f":"'SP4'!I95","v":"16:20:00,00"},{"$f":"'SP4'!J95","v":"16:21:49,21"},{"$f":"'SP4'!K95","v":"00:01:49.210"},{"$f":"'SP4'!L95","v":"00:01:49.210"},{"$f":"'SP4'!M95","v":"00:00:20.790"},{"$f":"'SP4'!S95","v":"Fahrer Wolfgang Schertler mit der StartNr. 93 ,hat erfolgreich die Prüfung SP4 absolviert. Zeit: -"},{"$f":"'SP4'!T95","v":"00:00:20.790"},{"$f":"'SP4'!V95","v":0}]
[{"$f":"'SP4'!I96","v":"16:33:00,00"},{"$f":"'SP4'!J96","v":"16:35:09,96"},{"$f":"'SP4'!K96","v":"00:02:09.960"},{"$f":"'SP4'!L96","v":"00:02:09.960"},{"$f":"'SP4'!M96","v":"00:00:00.040"},{"$f":"'SP4'!S96","v":"Fahrer Thomas Katzensteiner mit der StartNr. 94 ,hat erfolgreich die Prüfung SP4 absolviert. Zeit: -"},{"$f":"'SP4'!T96","v":"00:00:00.040"},{"$f":"'SP4'!V96","v":0}]
[{"$f":"'SP4'!I97","v":"16:27:00,00"},{"$f":"'SP4'!J97","v":"16:29:08,84"},{"$f":"'SP4'!K97","v":"00:02:08.840"},{"$f":"'SP4'!L97","v":"00:02:08.840"},{"$f":"'SP4'!M97","v":"00:00:01.160"},{"$f":"'SP4'!S97","v":"Fahrer Hagen Hackenberg mit der StartNr. 95 ,hat erfolgreich die Prüfung SP4 absolviert. Zeit: -"},{"$f":"'SP4'!T97","v":"00:00:01.160"},{"$f":"'SP4'!V97","v":0}]
[{"$f":"'SP4'!I98","v":"16:28:00,00"},{"$f":"'SP4'!J98","v":"16:30:10,59"},{"$f":"'SP4'!K98","v":"00:02:10.590"},{"$f":"'SP4'!L98","v":"00:02:10.590"},{"$f":"'SP4'!M98","v":"00:00:00.590"},{"$f":"'SP4'!S98","v":"Fahrer Oliver Dietz mit der StartNr. 96 ,hat erfolgreich die Prüfung SP4 absolviert. Zeit: "},{"$f":"'SP4'!T98","v":"00:00:00.590"},{"$f":"'SP4'!V98","v":0}]
[{"$f":"'SP4'!I99","v":""},{"$f":"'SP4'!J99","v":"16:58:08,41"},{"$f":"'SP4'!K99","v":""},{"$f":"'SP4'!L99","v":""},{"$f":"'SP4'!M99","v":{"$error":"#VALUE!"}},{"$f":"'SP4'!S99","v":""},{"$f":"'SP4'!T99","v":""},{"$f":"'SP4'!V99","v":0}]
[{"$f":"'SP4'!I100","v":""},{"$f":"'SP4'!J100","v":"16:39:13,71"},{"$f":"'SP4'!K100","v":""},{"$f":"'SP4'!L100","v":""},{"$f":"'SP4'!M100","v":{"$error":"#VALUE!"}},{"$f":"'SP4'!S100","v":""},{"$f":"'SP4'!T100","v":""},{"$f":"'SP4'!V100","v":0}]
[{"$f":"'SP4'!I101","v":"16:29:00,00"},{"$f":"'SP4'!J101","v":"16:31:09,58"},{"$f":"'SP4'!K101","v":"00:02:09.580"},{"$f":"'SP4'!L101","v":"00:02:09.580"},{"$f":"'SP4'!M101","v":"00:00:00.420"},{"$f":"'SP4'!S101","v":"Fahrer Dirk Velte mit der StartNr. 99 ,hat erfolgreich die Prüfung SP4 absolviert. Zeit: -"},{"$f":"'SP4'!T101","v":"00:00:00.420"},{"$f":"'SP4'!V101","v":0}]
[{"$f":"'SP4'!I102","v":"16:11:00,00"},{"$f":"'SP4'!J102","v":"16:13:09,31"},{"$f":"'SP4'!K102","v":"00:02:09.310"},{"$f":"'SP4'!L102","v":"00:02:09.310"},{"$f":"'SP4'!M102","v":"00:00:00.690"},{"$f":"'SP4'!S102","v":"Fahrer Thorsten Krack mit der StartNr. 100 ,hat erfolgreich die Prüfung SP4 absolviert. Zeit: -"},{"$f":"'SP4'!T102","v":"00:00:00.690"},{"$f":"'SP4'!V102","v":0}]
[{"$f":"'SP4'!I103","v":"16:25:00,00"},{"$f":"'SP4'!J103","v":"16:27:10,23"},{"$f":"'SP4'!K103","v":"00:02:10.230"},{"$f":"'SP4'!L103","v":"00:02:10.230"},{"$f":"'SP4'!M103","v":"00:00:00.230"},{"$f":"'SP4'!S103","v":"Fahrer Christian Wittek mit der StartNr. 101 ,hat erfolgreich die Prüfung SP4 absolviert. Zeit: "},{"$f":"'SP4'!T103","v":"00:00:00.230"},{"$f":"'SP4'!V103","v":0}]
[{"$f":"'SP4'!I104","v":"16:12:00,00"},{"$f":"'SP4'!J104","v":"16:14:17,19"},{"$f":"'SP4'!K104","v":"00:02:17.190"},{"$f":"'SP4'!L104","v":"00:02:17.190"},{"$f":"'SP4'!M104","v":"00:00:07.190"},{"$f":"'SP4'!S104","v":"Fahrer Benjamin Hix mit der StartNr. 102 ,hat erfolgreich die Prüfung SP4 absolviert. Zeit: "},{"$f":"'SP4'!T104","v":"00:00:07.190"},{"$f":"'SP4'!V104","v":0}]

{"sheet":"Export_SP5","index":12,"n_rows":102,"n_cols":5,"rows_kept":102,"cut":false,"hidden":false,"merged":[]}
[{"$f":"SP5_Sprint!G2","v":"00:00:30.330"},{"$f":"SP5_Sprint!H2","v":"00:00:00.670"},{"$f":"SP5_Sprint!O2","v":"Fahrer Christian Jäger mit der StartNr. 1 ,hat erfolgreich die Prüfung SP5 absolviert. Zeit: -"},{"$f":"SP5_Sprint!P2","v":"00:00:00.670"},{"$f":"SP5_Sprint!R2","v":"x"}]
[{"$f":"SP5_Sprint!G3","v":"00:00:30.750"},{"$f":"SP5_Sprint!H3","v":"00:00:00.250"},{"$f":"SP5_Sprint!O3","v":"Fahrer Daniel Rinck mit der StartNr. 2 ,hat erfolgreich die Prüfung SP5 absolviert. Zeit: -"},{"$f":"SP5_Sprint!P3","v":"00:00:00.250"},{"$f":"SP5_Sprint!R3","v":1}]
[{"$f":"SP5_Sprint!G4","v":"00:00:31.780"},{"$f":"SP5_Sprint!H4","v":"00:00:00.780"},{"$f":"SP5_Sprint!O4","v":"Fahrer Malte Proff-Klein mit der StartNr. 3 ,hat erfolgreich die Prüfung SP5 absolviert. Zeit: "},{"$f":"SP5_Sprint!P4","v":"00:00:00.780"},{"$f":"SP5_Sprint!R4","v":1}]
[{"$f":"SP5_Sprint!G5","v":"00:00:32.640"},{"$f":"SP5_Sprint!H5","v":"00:00:01.640"},{"$f":"SP5_Sprint!O5","v":"Fahrer Dietmar Siemssen mit der StartNr. 4 ,hat erfolgreich die Prüfung SP5 absolviert. Zeit: "},{"$f":"SP5_Sprint!P5","v":"00:00:01.640"},{"$f":"SP5_Sprint!R5","v":1}]
[{"$f":"SP5_Sprint!G6","v":"00:00:35.230"},{"$f":"SP5_Sprint!H6","v":"00:00:04.230"},{"$f":"SP5_Sprint!O6","v":"Fahrer Franz-Michael Hartmann mit der StartNr. 5 ,hat erfolgreich die Prüfung SP5 absolviert. Zeit: "},{"$f":"SP5_Sprint!P6","v":"00:00:04.230"},{"$f":"SP5_Sprint!R6","v":1}]
[{"$f":"SP5_Sprint!G7","v":"00:00:29.750"},{"$f":"SP5_Sprint!H7","v":"00:00:01.250"},{"$f":"SP5_Sprint!O7","v":"Fahrer Christoph Schroer mit der StartNr. 6 ,hat erfolgreich die Prüfung SP5 absolviert. Zeit: -"},{"$f":"SP5_Sprint!P7","v":"00:00:01.250"},{"$f":"SP5_Sprint!R7","v":1}]
[{"$f":"SP5_Sprint!G8","v":"00:00:30.280"},{"$f":"SP5_Sprint!H8","v":"00:00:00.720"},{"$f":"SP5_Sprint!O8","v":"Fahrer Jochen Artzinger-Bolten mit der StartNr. 7 ,hat erfolgreich die Prüfung SP5 absolviert. Zeit: -"},{"$f":"SP5_Sprint!P8","v":"00:00:00.720"},{"$f":"SP5_Sprint!R8","v":1}]
[{"$f":"SP5_Sprint!G9","v":"00:00:30.590"},{"$f":"SP5_Sprint!H9","v":"00:00:00.410"},{"$f":"SP5_Sprint!O9","v":"Fahrer Friedhelm Eickhorn mit der StartNr. 8 ,hat erfolgreich die Prüfung SP5 absolviert. Zeit: -"},{"$f":"SP5_Sprint!P9","v":"00:00:00.410"},{"$f":"SP5_Sprint!R9","v":1}]
[{"$f":"SP5_Sprint!G10","v":"00:00:30.850"},{"$f":"SP5_Sprint!H10","v":"00:00:00.150"},{"$f":"SP5_Sprint!O10","v":"Fahrer Carsten Reblin mit der StartNr. 9 ,hat erfolgreich die Prüfung SP5 absolviert. Zeit: -"},{"$f":"SP5_Sprint!P10","v":"00:00:00.150"},{"$f":"SP5_Sprint!R10","v":1}]
[{"$f":"SP5_Sprint!G11","v":"00:00:34.030"},{"$f":"SP5_Sprint!H11","v":"00:00:03.030"},{"$f":"SP5_Sprint!O11","v":"Fahrer Dieter Dinges mit der StartNr. 10 ,hat erfolgreich die Prüfung SP5 absolviert. Zeit: "},{"$f":"SP5_Sprint!P11","v":"00:00:03.030"},{"$f":"SP5_Sprint!R11","v":1}]
[{"$f":"SP5_Sprint!G12","v":"00:00:31.080"},{"$f":"SP5_Sprint!H12","v":"00:00:00.080"},{"$f":"SP5_Sprint!O12","v":"Fahrer Wolfgang Reeh mit der StartNr. 11 ,hat erfolgreich die Prüfung SP5 absolviert. Zeit: "},{"$f":"SP5_Sprint!P12","v":"00:00:00.080"},{"$f":"SP5_Sprint!R12","v":1}]
[{"$f":"SP5_Sprint!G13","v":"00:00:29.820"},{"$f":"SP5_Sprint!H13","v":"00:00:01.180"},{"$f":"SP5_Sprint!O13","v":"Fahrer Andreas Petry mit der StartNr. 12 ,hat erfolgreich die Prüfung SP5 absolviert. Zeit: -"},{"$f":"SP5_Sprint!P13","v":"00:00:01.180"},{"$f":"SP5_Sprint!R13","v":1}]
[{"$f":"SP5_Sprint!G14","v":"00:00:30.110"},{"$f":"SP5_Sprint!H14","v":"00:00:00.890"},{"$f":"SP5_Sprint!O14","v":"Fahrer Ted Prenzel mit der StartNr. 13 ,hat erfolgreich die Prüfung SP5 absolviert. Zeit: -"},{"$f":"SP5_Sprint!P14","v":"00:00:00.890"},{"$f":"SP5_Sprint!R14","v":1}]
[{"$f":"SP5_Sprint!G15","v":"00:00:33.950"},{"$f":"SP5_Sprint!H15","v":"00:00:02.950"},{"$f":"SP5_Sprint!O15","v":"Fahrer Micha Barsties mit der StartNr. 14 ,hat erfolgreich die Prüfung SP5 absolviert. Zeit: "},{"$f":"SP5_Sprint!P15","v":"00:00:02.950"},{"$f":"SP5_Sprint!R15","v":1}]
[{"$f":"SP5_Sprint!G16","v":"00:00:31.860"},{"$f":"SP5_Sprint!H16","v":"00:00:00.860"},{"$f":"SP5_Sprint!O16","v":"Fahrer Klaus Flettner mit der StartNr. 15 ,hat erfolgreich die Prüfung SP5 absolviert. Zeit: "},{"$f":"SP5_Sprint!P16","v":"00:00:00.860"},{"$f":"SP5_Sprint!R16","v":1}]
[{"$f":"SP5_Sprint!G17","v":"00:00:31.290"},{"$f":"SP5_Sprint!H17","v":"00:00:00.290"},{"$f":"SP5_Sprint!O17","v":"Fahrer Heinz Frey mit der StartNr. 16 ,hat erfolgreich die Prüfung SP5 absolviert. Zeit: "},{"$f":"SP5_Sprint!P17","v":"00:00:00.290"},{"$f":"SP5_Sprint!R17","v":1}]
[{"$f":"SP5_Sprint!G18","v":"00:00:31.270"},{"$f":"SP5_Sprint!H18","v":"00:00:00.270"},{"$f":"SP5_Sprint!O18","v":"Fahrer Henning Reichel mit der StartNr. 17 ,hat erfolgreich die Prüfung SP5 absolviert. Zeit: "},{"$f":"SP5_Sprint!P18","v":"00:00:00.270"},{"$f":"SP5_Sprint!R18","v":1}]
[{"$f":"SP5_Sprint!G19","v":"00:00:31.970"},{"$f":"SP5_Sprint!H19","v":"00:00:00.970"},{"$f":"SP5_Sprint!O19","v":"Fahrer Maik Käbisch mit der StartNr. 18 ,hat erfolgreich die Prüfung SP5 absolviert. Zeit: "},{"$f":"SP5_Sprint!P19","v":"00:00:00.970"},{"$f":"SP5_Sprint!R19","v":1}]
[{"$f":"SP5_Sprint!G20","v":"00:00:00"},{"$f":"SP5_Sprint!H20","v":"00:00:00"},{"$f":"SP5_Sprint!O20","v":0},{"$f":"SP5_Sprint!P20","v":"00:00:00"},{"$f":"SP5_Sprint!R20","v":0}]
[{"$f":"SP5_Sprint!G21","v":"00:00:32.610"},{"$f":"SP5_Sprint!H21","v":"00:00:01.610"},{"$f":"SP5_Sprint!O21","v":"Fahrer Reinhard Grzesik mit der StartNr. 20 ,hat erfolgreich die Prüfung SP5 absolviert. Zeit: "},{"$f":"SP5_Sprint!P21","v":"00:00:01.610"},{"$f":"SP5_Sprint!R21","v":1}]
[{"$f":"SP5_Sprint!G22","v":"00:00:34.970"},{"$f":"SP5_Sprint!H22","v":"00:00:03.970"},{"$f":"SP5_Sprint!O22","v":"Fahrer Jörg Sihler mit der StartNr. 21 ,hat erfolgreich die Prüfung SP5 absolviert. Zeit: "},{"$f":"SP5_Sprint!P22","v":"00:00:03.970"},{"$f":"SP5_Sprint!R22","v":1}]
[{"$f":"SP5_Sprint!G23","v":"00:00:30.660"},{"$f":"SP5_Sprint!H23","v":"00:00:00.340"},{"$f":"SP5_Sprint!O23","v":"Fahrer Ingo Winterstein mit der StartNr. 22 ,hat erfolgreich die Prüfung SP5 absolviert. Zeit: -"},{"$f":"SP5_Sprint!P23","v":"00:00:00.340"},{"$f":"SP5_Sprint!R23","v":1}]
[{"$f":"SP5_Sprint!G24","v":"00:00:31.930"},{"$f":"SP5_Sprint!H24","v":"00:00:00.930"},{"$f":"SP5_Sprint!O24","v":"Fahrer Hans Werner Melchior mit der StartNr. 23 ,hat erfolgreich die Prüfung SP5 absolviert. Zeit: "},{"$f":"SP5_Sprint!P24","v":"00:00:00.930"},{"$f":"SP5_Sprint!R24","v":1}]
[{"$f":"SP5_Sprint!G25","v":"00:00:33.900"},{"$f":"SP5_Sprint!H25","v":"00:00:02.900"},{"$f":"SP5_Sprint!O25","v":"Fahrer Marco Oriolo mit der StartNr. 24 ,hat erfolgreich die Prüfung SP5 absolviert. Zeit: "},{"$f":"SP5_Sprint!P25","v":"00:00:02.900"},{"$f":"SP5_Sprint!R25","v":1}]
[{"$f":"SP5_Sprint!G26","v":"00:00:35,92"},{"$f":"SP5_Sprint!H26","v":"00:00:04.920"},{"$f":"SP5_Sprint!O26","v":"Fahrer Manfred Stommel mit der StartNr. 25 ,hat erfolgreich die Prüfung SP5 absolviert. Zeit: "},{"$f":"SP5_Sprint!P26","v":"00:00:04.920"},{"$f":"SP5_Sprint!R26","v":1}]
[{"$f":"SP5_Sprint!G27","v":"00:00:30.840"},{"$f":"SP5_Sprint!H27","v":"00:00:00.160"},{"$f":"SP5_Sprint!O27","v":"Fahrer Carolin Heusel mit der StartNr. 26 ,hat erfolgreich die Prüfung SP5 absolviert. Zeit: -"},{"$f":"SP5_Sprint!P27","v":"00:00:00.160"},{"$f":"SP5_Sprint!R27","v":1}]
[{"$f":"SP5_Sprint!G28","v":"00:00:34.520"},{"$f":"SP5_Sprint!H28","v":"00:00:03.520"},{"$f":"SP5_Sprint!O28","v":"Fahrer Regina Philippi mit der StartNr. 27 ,hat erfolgreich die Prüfung SP5 absolviert. Zeit: "},{"$f":"SP5_Sprint!P28","v":"00:00:03.520"},{"$f":"SP5_Sprint!R28","v":1}]
[{"$f":"SP5_Sprint!G29","v":"00:00:33.010"},{"$f":"SP5_Sprint!H29","v":"00:00:02.010"},{"$f":"SP5_Sprint!O29","v":"Fahrer Christof Aha mit der StartNr. 28 ,hat erfolgreich die Prüfung SP5 absolviert. Zeit: "},{"$f":"SP5_Sprint!P29","v":"00:00:02.010"},{"$f":"SP5_Sprint!R29","v":1}]
[{"$f":"SP5_Sprint!G30","v":"00:00:35.440"},{"$f":"SP5_Sprint!H30","v":"00:00:04.440"},{"$f":"SP5_Sprint!O30","v":"Fahrer Dennis Weiss mit der StartNr. 29 ,hat erfolgreich die Prüfung SP5 absolviert. Zeit: "},{"$f":"SP5_Sprint!P30","v":"00:00:04.440"},{"$f":"SP5_Sprint!R30","v":1}]
[{"$f":"SP5_Sprint!G31","v":"00:00:30.270"},{"$f":"SP5_Sprint!H31","v":"00:00:00.730"},{"$f":"SP5_Sprint!O31","v":"Fahrer Harald Hamprecht mit der StartNr. 30 ,hat erfolgreich die Prüfung SP5 absolviert. Zeit: -"},{"$f":"SP5_Sprint!P31","v":"00:00:00.730"},{"$f":"SP5_Sprint!R31","v":1}]
[{"$f":"SP5_Sprint!G32","v":"00:00:33.460"},{"$f":"SP5_Sprint!H32","v":"00:00:02.460"},{"$f":"SP5_Sprint!O32","v":"Fahrer Reno Fiolic mit der StartNr. 31 ,hat erfolgreich die Prüfung SP5 absolviert. Zeit: "},{"$f":"SP5_Sprint!P32","v":"00:00:02.460"},{"$f":"SP5_Sprint!R32","v":1}]
[{"$f":"SP5_Sprint!G33","v":"00:00:30,69"},{"$f":"SP5_Sprint!H33","v":"00:00:00.310"},{"$f":"SP5_Sprint!O33","v":"Fahrer Jürgen Kulpe mit der StartNr. 32 ,hat erfolgreich die Prüfung SP5 absolviert. Zeit: "},{"$f":"SP5_Sprint!P33","v":"00:00:00.310"},{"$f":"SP5_Sprint!R33","v":1}]
[{"$f":"SP5_Sprint!G34","v":"00:00:31,25"},{"$f":"SP5_Sprint!H34","v":"00:00:00.250"},{"$f":"SP5_Sprint!O34","v":"Fahrer Konstantin Kovarbasic mit der StartNr. 33 ,hat erfolgreich die Prüfung SP5 absolviert. Zeit: "},{"$f":"SP5_Sprint!P34","v":"00:00:00.250"},{"$f":"SP5_Sprint!R34","v":1}]
[{"$f":"SP5_Sprint!G35","v":"00:00:31.710"},{"$f":"SP5_Sprint!H35","v":"00:00:00.710"},{"$f":"SP5_Sprint!O35","v":"Fahrer Nikolaus Kratz mit der StartNr. 34 ,hat erfolgreich die Prüfung SP5 absolviert. Zeit: "},{"$f":"SP5_Sprint!P35","v":"00:00:00.710"},{"$f":"SP5_Sprint!R35","v":1}]
[{"$f":"SP5_Sprint!G36","v":"00:00:31.520"},{"$f":"SP5_Sprint!H36","v":"00:00:00.520"},{"$f":"SP5_Sprint!O36","v":"Fahrer Andreas Eberhardt mit der StartNr. 35 ,hat erfolgreich die Prüfung SP5 absolviert. Zeit: "},{"$f":"SP5_Sprint!P36","v":"00:00:00.520"},{"$f":"SP5_Sprint!R36","v":1}]
[{"$f":"SP5_Sprint!G37","v":"00:00:30.790"},{"$f":"SP5_Sprint!H37","v":"00:00:00.210"},{"$f":"SP5_Sprint!O37","v":"Fahrer Gerhard Thomas mit der StartNr. 36 ,hat erfolgreich die Prüfung SP5 absolviert. Zeit: -"},{"$f":"SP5_Sprint!P37","v":"00:00:00.210"},{"$f":"SP5_Sprint!R37","v":1}]
[{"$f":"SP5_Sprint!G38","v":"00:00:30.960"},{"$f":"SP5_Sprint!H38","v":"00:00:00.040"},{"$f":"SP5_Sprint!O38","v":"Fahrer Lotzi Kende mit der StartNr. 37 ,hat erfolgreich die Prüfung SP5 absolviert. Zeit: -"},{"$f":"SP5_Sprint!P38","v":"00:00:00.040"},{"$f":"SP5_Sprint!R38","v":1}]
[{"$f":"SP5_Sprint!G39","v":"00:00:30,58"},{"$f":"SP5_Sprint!H39","v":"00:00:00.420"},{"$f":"SP5_Sprint!O39","v":"Fahrer Jockel Winkelhock mit der StartNr. 38 ,hat erfolgreich die Prüfung SP5 absolviert. Zeit: "},{"$f":"SP5_Sprint!P39","v":"00:00:00.420"},{"$f":"SP5_Sprint!R39","v":1}]
[{"$f":"SP5_Sprint!G40","v":"00:00:28.700"},{"$f":"SP5_Sprint!H40","v":"00:00:02.300"},{"$f":"SP5_Sprint!O40","v":"Fahrer Sascha Wilkesmann mit der StartNr. 39 ,hat erfolgreich die Prüfung SP5 absolviert. Zeit: -"},{"$f":"SP5_Sprint!P40","v":"00:00:02.300"},{"$f":"SP5_Sprint!R40","v":1}]
[{"$f":"SP5_Sprint!G41","v":"00:00:36.450"},{"$f":"SP5_Sprint!H41","v":"00:00:05.450"},{"$f":"SP5_Sprint!O41","v":"Fahrer Gregor Schulz mit der StartNr. 40 ,hat erfolgreich die Prüfung SP5 absolviert. Zeit: "},{"$f":"SP5_Sprint!P41","v":"00:00:05.450"},{"$f":"SP5_Sprint!R41","v":"x"}]
[{"$f":"SP5_Sprint!G42","v":"00:00:30.600"},{"$f":"SP5_Sprint!H42","v":"00:00:00.400"},{"$f":"SP5_Sprint!O42","v":"Fahrer Peer Hildmann mit der StartNr. 41 ,hat erfolgreich die Prüfung SP5 absolviert. Zeit: -"},{"$f":"SP5_Sprint!P42","v":"00:00:00.400"},{"$f":"SP5_Sprint!R42","v":"x"}]
[{"$f":"SP5_Sprint!G43","v":"00:00:30,61"},{"$f":"SP5_Sprint!H43","v":"00:00:00.390"},{"$f":"SP5_Sprint!O43","v":"Fahrer Mina Tander mit der StartNr. 42 ,hat erfolgreich die Prüfung SP5 absolviert. Zeit: "},{"$f":"SP5_Sprint!P43","v":"00:00:00.390"},{"$f":"SP5_Sprint!R43","v":1}]
[{"$f":"SP5_Sprint!G44","v":""},{"$f":"SP5_Sprint!H44","v":{"$error":"#VALUE!"}},{"$f":"SP5_Sprint!O44","v":""},{"$f":"SP5_Sprint!P44","v":""},{"$f":"SP5_Sprint!R44","v":0}]
[{"$f":"SP5_Sprint!G45","v":"00:00:29.180"},{"$f":"SP5_Sprint!H45","v":"00:00:01.820"},{"$f":"SP5_Sprint!O45","v":"Fahrer Jean-Philippe Kempf mit der StartNr. 44 ,hat erfolgreich die Prüfung SP5 absolviert. Zeit: -"},{"$f":"SP5_Sprint!P45","v":"00:00:01.820"},{"$f":"SP5_Sprint!R45","v":1}]
[{"$f":"SP5_Sprint!G46","v":"00:00:30.480"},{"$f":"SP5_Sprint!H46","v":"00:00:00.520"},{"$f":"SP5_Sprint!O46","v":"Fahrer Daniel Martin mit der StartNr. 45 ,hat erfolgreich die Prüfung SP5 absolviert. Zeit: -"},{"$f":"SP5_Sprint!P46","v":"00:00:00.520"},{"$f":"SP5_Sprint!R46","v":1}]
[{"$f":"SP5_Sprint!G47","v":"00:00:30.070"},{"$f":"SP5_Sprint!H47","v":"00:00:00.930"},{"$f":"SP5_Sprint!O47","v":"Fahrer Elena Funk mit der StartNr. 46 ,hat erfolgreich die Prüfung SP5 absolviert. Zeit: -"},{"$f":"SP5_Sprint!P47","v":"00:00:00.930"},{"$f":"SP5_Sprint!R47","v":1}]
[{"$f":"SP5_Sprint!G48","v":"00:00:31.360"},{"$f":"SP5_Sprint!H48","v":"00:00:00.360"},{"$f":"SP5_Sprint!O48","v":"Fahrer Hans Mutschall mit der StartNr. 47 ,hat erfolgreich die Prüfung SP5 absolviert. Zeit: "},{"$f":"SP5_Sprint!P48","v":"00:00:00.360"},{"$f":"SP5_Sprint!R48","v":1}]
[{"$f":"SP5_Sprint!G49","v":"00:00:49.770"},{"$f":"SP5_Sprint!H49","v":"00:00:18.770"},{"$f":"SP5_Sprint!O49","v":"Fahrer Kahled Rahman mit der StartNr. 48 ,hat erfolgreich die Prüfung SP5 absolviert. Zeit: "},{"$f":"SP5_Sprint!P49","v":"00:00:18.770"},{"$f":"SP5_Sprint!R49","v":1}]
[{"$f":"SP5_Sprint!G50","v":"00:00:30.960"},{"$f":"SP5_Sprint!H50","v":"00:00:00.040"},{"$f":"SP5_Sprint!O50","v":"Fahrer Jochen Schwarz mit der StartNr. 49 ,hat erfolgreich die Prüfung SP5 absolviert. Zeit: -"},{"$f":"SP5_Sprint!P50","v":"00:00:00.040"},{"$f":"SP5_Sprint!R50","v":1}]
[{"$f":"SP5_Sprint!G51","v":"00:00:35,41"},{"$f":"SP5_Sprint!H51","v":"00:00:04.410"},{"$f":"SP5_Sprint!O51","v":"Fahrer Axel Nawrath mit der StartNr. 50 ,hat erfolgreich die Prüfung SP5 absolviert. Zeit: "},{"$f":"SP5_Sprint!P51","v":"00:00:04.410"},{"$f":"SP5_Sprint!R51","v":1}]
[{"$f":"SP5_Sprint!G52","v":"00:00:33.390"},{"$f":"SP5_Sprint!H52","v":"00:00:02.390"},{"$f":"SP5_Sprint!O52","v":"Fahrer Birgit Claussen mit der StartNr. 51 ,hat erfolgreich die Prüfung SP5 absolviert. Zeit: "},{"$f":"SP5_Sprint!P52","v":"00:00:02.390"},{"$f":"SP5_Sprint!R52","v":1}]
[{"$f":"SP5_Sprint!G53","v":"00:00:34.210"},{"$f":"SP5_Sprint!H53","v":"00:00:03.210"},{"$f":"SP5_Sprint!O53","v":"Fahrer Harald König mit der StartNr. 52 ,hat erfolgreich die Prüfung SP5 absolviert. Zeit: "},{"$f":"SP5_Sprint!P53","v":"00:00:03.210"},{"$f":"SP5_Sprint!R53","v":1}]
[{"$f":"SP5_Sprint!G54","v":"00:00:30.380"},{"$f":"SP5_Sprint!H54","v":"00:00:00.620"},{"$f":"SP5_Sprint!O54","v":"Fahrer Thomas Blank mit der StartNr. 53 ,hat erfolgreich die Prüfung SP5 absolviert. Zeit: -"},{"$f":"SP5_Sprint!P54","v":"00:00:00.620"},{"$f":"SP5_Sprint!R54","v":1}]
[{"$f":"SP5_Sprint!G55","v":"00:00:30.960"},{"$f":"SP5_Sprint!H55","v":"00:00:00.040"},{"$f":"SP5_Sprint!O55","v":"Fahrer Heidi Eberhardt mit der StartNr. 54 ,hat erfolgreich die Prüfung SP5 absolviert. Zeit: -"},{"$f":"SP5_Sprint!P55","v":"00:00:00.040"},{"$f":"SP5_Sprint!R55","v":1}]
[{"$f":"SP5_Sprint!G56","v":"00:00:30.770"},{"$f":"SP5_Sprint!H56","v":"00:00:00.230"},{"$f":"SP5_Sprint!O56","v":"Fahrer Karina Ansos mit der StartNr. 55 ,hat erfolgreich die Prüfung SP5 absolviert. Zeit: -"},{"$f":"SP5_Sprint!P56","v":"00:00:00.230"},{"$f":"SP5_Sprint!R56","v":1}]
[{"$f":"SP5_Sprint!G57","v":"00:00:31.370"},{"$f":"SP5_Sprint!H57","v":"00:00:00.370"},{"$f":"SP5_Sprint!O57","v":"Fahrer Michael Gotta mit der StartNr. 56 ,hat erfolgreich die Prüfung SP5 absolviert. Zeit: "},{"$f":"SP5_Sprint!P57","v":"00:00:00.370"},{"$f":"SP5_Sprint!R57","v":1}]
[{"$f":"SP5_Sprint!G58","v":"00:00:29"},{"$f":"SP5_Sprint!H58","v":"00:00:02"},{"$f":"SP5_Sprint!O58","v":"Fahrer Stefanie Rinck mit der StartNr. 57 ,hat erfolgreich die Prüfung SP5 absolviert. Zeit: -"},{"$f":"SP5_Sprint!P58","v":"00:00:02"},{"$f":"SP5_Sprint!R58","v":1}]
[{"$f":"SP5_Sprint!G59","v":"00:00:31.180"},{"$f":"SP5_Sprint!H59","v":"00:00:00.180"},{"$f":"SP5_Sprint!O59","v":"Fahrer Armin Slotta mit der StartNr. 58 ,hat erfolgreich die Prüfung SP5 absolviert. Zeit: "},{"$f":"SP5_Sprint!P59","v":"00:00:00.180"},{"$f":"SP5_Sprint!R59","v":1}]
[{"$f":"SP5_Sprint!G60","v":"00:00:30.880"},{"$f":"SP5_Sprint!H60","v":"00:00:00.120"},{"$f":"SP5_Sprint!O60","v":"Fahrer Julia Kende mit der StartNr. 59 ,hat erfolgreich die Prüfung SP5 absolviert. Zeit: -"},{"$f":"SP5_Sprint!P60","v":"00:00:00.120"},{"$f":"SP5_Sprint!R60","v":1}]
[{"$f":"SP5_Sprint!G61","v":"00:00:32.010"},{"$f":"SP5_Sprint!H61","v":"00:00:01.010"},{"$f":"SP5_Sprint!O61","v":"Fahrer Robert Bleckmann mit der StartNr. 60 ,hat erfolgreich die Prüfung SP5 absolviert. Zeit: "},{"$f":"SP5_Sprint!P61","v":"00:00:01.010"},{"$f":"SP5_Sprint!R61","v":1}]
[{"$f":"SP5_Sprint!G62","v":"00:00:32.260"},{"$f":"SP5_Sprint!H62","v":"00:00:01.260"},{"$f":"SP5_Sprint!O62","v":"Fahrer Christof Harwardt mit der StartNr. 61 ,hat erfolgreich die Prüfung SP5 absolviert. Zeit: "},{"$f":"SP5_Sprint!P62","v":"00:00:01.260"},{"$f":"SP5_Sprint!R62","v":1}]
[{"$f":"SP5_Sprint!G63","v":"00:00:33.960"},{"$f":"SP5_Sprint!H63","v":"00:00:02.960"},{"$f":"SP5_Sprint!O63","v":"Fahrer Thomas Kahns mit der StartNr. 62 ,hat erfolgreich die Prüfung SP5 absolviert. Zeit: "},{"$f":"SP5_Sprint!P63","v":"00:00:02.960"},{"$f":"SP5_Sprint!R63","v":1}]
[{"$f":"SP5_Sprint!G64","v":"00:00:31.180"},{"$f":"SP5_Sprint!H64","v":"00:00:00.180"},{"$f":"SP5_Sprint!O64","v":"Fahrer Maximilian Herbst mit der StartNr. 63 ,hat erfolgreich die Prüfung SP5 absolviert. Zeit: "},{"$f":"SP5_Sprint!P64","v":"00:00:00.180"},{"$f":"SP5_Sprint!R64","v":1}]
[{"$f":"SP5_Sprint!G65","v":"00:00:30.760"},{"$f":"SP5_Sprint!H65","v":"00:00:00.240"},{"$f":"SP5_Sprint!O65","v":"Fahrer Jürgen Buchhold mit der StartNr. 64 ,hat erfolgreich die Prüfung SP5 absolviert. Zeit: -"},{"$f":"SP5_Sprint!P65","v":"00:00:00.240"},{"$f":"SP5_Sprint!R65","v":1}]
[{"$f":"SP5_Sprint!G66","v":""},{"$f":"SP5_Sprint!H66","v":{"$error":"#VALUE!"}},{"$f":"SP5_Sprint!O66","v":""},{"$f":"SP5_Sprint!P66","v":""},{"$f":"SP5_Sprint!R66","v":0}]
[{"$f":"SP5_Sprint!G67","v":"00:00:31.840"},{"$f":"SP5_Sprint!H67","v":"00:00:00.840"},{"$f":"SP5_Sprint!O67","v":"Fahrer Peter Bel mit der StartNr. 66 ,hat erfolgreich die Prüfung SP5 absolviert. Zeit: "},{"$f":"SP5_Sprint!P67","v":"00:00:00.840"},{"$f":"SP5_Sprint!R67","v":1}]
[{"$f":"SP5_Sprint!G68","v":"00:00:35.690"},{"$f":"SP5_Sprint!H68","v":"00:00:04.690"},{"$f":"SP5_Sprint!O68","v":"Fahrer Thomas Mirau mit der StartNr. 67 ,hat erfolgreich die Prüfung SP5 absolviert. Zeit: "},{"$f":"SP5_Sprint!P68","v":"00:00:04.690"},{"$f":"SP5_Sprint!R68","v":1}]
[{"$f":"SP5_Sprint!G69","v":"00:00:32.310"},{"$f":"SP5_Sprint!H69","v":"00:00:01.310"},{"$f":"SP5_Sprint!O69","v":"Fahrer Markus Gotta mit der StartNr. 68 ,hat erfolgreich die Prüfung SP5 absolviert. Zeit: "},{"$f":"SP5_Sprint!P69","v":"00:00:01.310"},{"$f":"SP5_Sprint!R69","v":1}]
[{"$f":"SP5_Sprint!G70","v":"00:00:31.990"},{"$f":"SP5_Sprint!H70","v":"00:00:00.990"},{"$f":"SP5_Sprint!O70","v":"Fahrer Robin Keulertz mit der StartNr. 69 ,hat erfolgreich die Prüfung SP5 absolviert. Zeit: "},{"$f":"SP5_Sprint!P70","v":"00:00:00.990"},{"$f":"SP5_Sprint!R70","v":1}]
[{"$f":"SP5_Sprint!G71","v":"00:00:30.040"},{"$f":"SP5_Sprint!H71","v":"00:00:00.960"},{"$f":"SP5_Sprint!O71","v":"Fahrer Christian Häp mit der StartNr. 70 ,hat erfolgreich die Prüfung SP5 absolviert. Zeit: -"},{"$f":"SP5_Sprint!P71","v":"00:00:00.960"},{"$f":"SP5_Sprint!R71","v":1}]
[{"$f":"SP5_Sprint!G72","v":"00:00:31.470"},{"$f":"SP5_Sprint!H72","v":"00:00:00.470"},{"$f":"SP5_Sprint!O72","v":"Fahrer Ingolf Zschockelt mit der StartNr. 71 ,hat erfolgreich die Prüfung SP5 absolviert. Zeit: "},{"$f":"SP5_Sprint!P72","v":"00:00:00.470"},{"$f":"SP5_Sprint!R72","v":1}]
[{"$f":"SP5_Sprint!G73","v":"00:00:30.260"},{"$f":"SP5_Sprint!H73","v":"00:00:00.740"},{"$f":"SP5_Sprint!O73","v":"Fahrer Michael Barsties mit der StartNr. 72 ,hat erfolgreich die Prüfung SP5 absolviert. Zeit: -"},{"$f":"SP5_Sprint!P73","v":"00:00:00.740"},{"$f":"SP5_Sprint!R73","v":1}]
[{"$f":"SP5_Sprint!G74","v":"00:00:29.690"},{"$f":"SP5_Sprint!H74","v":"00:00:01.310"},{"$f":"SP5_Sprint!O74","v":"Fahrer Ramona Wagner mit der StartNr. 73 ,hat erfolgreich die Prüfung SP5 absolviert. Zeit: -"},{"$f":"SP5_Sprint!P74","v":"00:00:01.310"},{"$f":"SP5_Sprint!R74","v":1}]
[{"$f":"SP5_Sprint!G75","v":"00:00:31.530"},{"$f":"SP5_Sprint!H75","v":"00:00:00.530"},{"$f":"SP5_Sprint!O75","v":"Fahrer Lars Fahrenbach mit der StartNr. 74 ,hat erfolgreich die Prüfung SP5 absolviert. Zeit: "},{"$f":"SP5_Sprint!P75","v":"00:00:00.530"},{"$f":"SP5_Sprint!R75","v":1}]
[{"$f":"SP5_Sprint!G76","v":"00:00:33.070"},{"$f":"SP5_Sprint!H76","v":"00:00:02.070"},{"$f":"SP5_Sprint!O76","v":"Fahrer Frank Hoefnagels mit der StartNr. 75 ,hat erfolgreich die Prüfung SP5 absolviert. Zeit: "},{"$f":"SP5_Sprint!P76","v":"00:00:02.070"},{"$f":"SP5_Sprint!R76","v":1}]
[{"$f":"SP5_Sprint!G77","v":"00:00:30.290"},{"$f":"SP5_Sprint!H77","v":"00:00:00.710"},{"$f":"SP5_Sprint!O77","v":"Fahrer Michael Karch mit der StartNr. 76 ,hat erfolgreich die Prüfung SP5 absolviert. Zeit: -"},{"$f":"SP5_Sprint!P77","v":"00:00:00.710"},{"$f":"SP5_Sprint!R77","v":1}]
[{"$f":"SP5_Sprint!G78","v":"00:00:31.360"},{"$f":"SP5_Sprint!H78","v":"00:00:00.360"},{"$f":"SP5_Sprint!O78","v":"Fahrer Dirk Götze mit der StartNr. 77 ,hat erfolgreich die Prüfung SP5 absolviert. Zeit: "},{"$f":"SP5_Sprint!P78","v":"00:00:00.360"},{"$f":"SP5_Sprint!R78","v":"x"}]
[{"$f":"SP5_Sprint!G79","v":"00:00:33.750"},{"$f":"SP5_Sprint!H79","v":"00:00:02.750"},{"$f":"SP5_Sprint!O79","v":"Fahrer Stefan Hillers mit der StartNr. 78 ,hat erfolgreich die Prüfung SP5 absolviert. Zeit: "},{"$f":"SP5_Sprint!P79","v":"00:00:02.750"},{"$f":"SP5_Sprint!R79","v":"x"}]
[{"$f":"SP5_Sprint!G80","v":"00:00:30.550"},{"$f":"SP5_Sprint!H80","v":"00:00:00.450"},{"$f":"SP5_Sprint!O80","v":"Fahrer Christian Rafflenbeul mit der StartNr. 79 ,hat erfolgreich die Prüfung SP5 absolviert. Zeit: -"},{"$f":"SP5_Sprint!P80","v":"00:00:00.450"},{"$f":"SP5_Sprint!R80","v":"x"}]
[{"$f":"SP5_Sprint!G81","v":"00:00:37.470"},{"$f":"SP5_Sprint!H81","v":"00:00:06.470"},{"$f":"SP5_Sprint!O81","v":"Fahrer Gerhard Reuschel mit der StartNr. 80 ,hat erfolgreich die Prüfung SP5 absolviert. Zeit: "},{"$f":"SP5_Sprint!P81","v":"00:00:06.470"},{"$f":"SP5_Sprint!R81","v":"x"}]
[{"$f":"SP5_Sprint!G82","v":"00:00:33.170"},{"$f":"SP5_Sprint!H82","v":"00:00:02.170"},{"$f":"SP5_Sprint!O82","v":"Fahrer Karsten Rachow mit der StartNr. 81 ,hat erfolgreich die Prüfung SP5 absolviert. Zeit: "},{"$f":"SP5_Sprint!P82","v":"00:00:02.170"},{"$f":"SP5_Sprint!R82","v":"x"}]
[{"$f":"SP5_Sprint!G83","v":""},{"$f":"SP5_Sprint!H83","v":{"$error":"#VALUE!"}},{"$f":"SP5_Sprint!O83","v":""},{"$f":"SP5_Sprint!P83","v":""},{"$f":"SP5_Sprint!R83","v":0}]
[{"$f":"SP5_Sprint!G84","v":"00:00:32.780"},{"$f":"SP5_Sprint!H84","v":"00:00:01.780"},{"$f":"SP5_Sprint!O84","v":"Fahrer Alexander Weil mit der StartNr. 83 ,hat erfolgreich die Prüfung SP5 absolviert. Zeit: "},{"$f":"SP5_Sprint!P84","v":"00:00:01.780"},{"$f":"SP5_Sprint!R84","v":"x"}]
[{"$f":"SP5_Sprint!G85","v":"00:00:32.250"},{"$f":"SP5_Sprint!H85","v":"00:00:01.250"},{"$f":"SP5_Sprint!O85","v":"Fahrer Josef Lindenberger mit der StartNr. 84 ,hat erfolgreich die Prüfung SP5 absolviert. Zeit: "},{"$f":"SP5_Sprint!P85","v":"00:00:01.250"},{"$f":"SP5_Sprint!R85","v":"x"}]
[{"$f":"SP5_Sprint!G86","v":"00:00:31.210"},{"$f":"SP5_Sprint!H86","v":"00:00:00.210"},{"$f":"SP5_Sprint!O86","v":"Fahrer Rick Durante mit der StartNr. 85 ,hat erfolgreich die Prüfung SP5 absolviert. Zeit: "},{"$f":"SP5_Sprint!P86","v":"00:00:00.210"},{"$f":"SP5_Sprint!R86","v":"x"}]
[{"$f":"SP5_Sprint!G87","v":"00:00:29.290"},{"$f":"SP5_Sprint!H87","v":"00:00:01.710"},{"$f":"SP5_Sprint!O87","v":"Fahrer Almuth Siemann mit der StartNr. 86 ,hat erfolgreich die Prüfung SP5 absolviert. Zeit: -"},{"$f":"SP5_Sprint!P87","v":"00:00:01.710"},{"$f":"SP5_Sprint!R87","v":"x"}]
[{"$f":"SP5_Sprint!G88","v":"00:00:39.270"},{"$f":"SP5_Sprint!H88","v":"00:00:08.270"},{"$f":"SP5_Sprint!O88","v":"Fahrer Axel Strigl mit der StartNr. 87 ,hat erfolgreich die Prüfung SP5 absolviert. Zeit: "},{"$f":"SP5_Sprint!P88","v":"00:00:08.270"},{"$f":"SP5_Sprint!R88","v":"x"}]
[{"$f":"SP5_Sprint!G89","v":"00:00:31.220"},{"$f":"SP5_Sprint!H89","v":"00:00:00.220"},{"$f":"SP5_Sprint!O89","v":"Fahrer Philip Sommer mit der StartNr. 88 ,hat erfolgreich die Prüfung SP5 absolviert. Zeit: "},{"$f":"SP5_Sprint!P89","v":"00:00:00.220"},{"$f":"SP5_Sprint!R89","v":"x"}]
[{"$f":"SP5_Sprint!G90","v":"00:00:31.960"},{"$f":"SP5_Sprint!H90","v":"00:00:00.960"},{"$f":"SP5_Sprint!O90","v":"Fahrer Jörg Diehl mit der StartNr. 89 ,hat erfolgreich die Prüfung SP5 absolviert. Zeit: "},{"$f":"SP5_Sprint!P90","v":"00:00:00.960"},{"$f":"SP5_Sprint!R90","v":"x"}]
[{"$f":"SP5_Sprint!G91","v":"00:00:31.300"},{"$f":"SP5_Sprint!H91","v":"00:00:00.300"},{"$f":"SP5_Sprint!O91","v":"Fahrer Matthias Herzig mit der StartNr. 90 ,hat erfolgreich die Prüfung SP5 absolviert. Zeit: "},{"$f":"SP5_Sprint!P91","v":"00:00:00.300"},{"$f":"SP5_Sprint!R91","v":"x"}]
[{"$f":"SP5_Sprint!G92","v":"00:00:30.940"},{"$f":"SP5_Sprint!H92","v":"00:00:00.060"},{"$f":"SP5_Sprint!O92","v":"Fahrer Christoph Pasternak mit der StartNr. 91 ,hat erfolgreich die Prüfung SP5 absolviert. Zeit: -"},{"$f":"SP5_Sprint!P92","v":"00:00:00.060"},{"$f":"SP5_Sprint!R92","v":"x"}]
[{"$f":"SP5_Sprint!G93","v":"00:00:31.050"},{"$f":"SP5_Sprint!H93","v":"00:00:00.050"},{"$f":"SP5_Sprint!O93","v":"Fahrer Lothar Schupet mit der StartNr. 92 ,hat erfolgreich die Prüfung SP5 absolviert. Zeit: "},{"$f":"SP5_Sprint!P93","v":"00:00:00.050"},{"$f":"SP5_Sprint!R93","v":"x"}]
[{"$f":"SP5_Sprint!G94","v":"00:00:32.200"},{"$f":"SP5_Sprint!H94","v":"00:00:01.200"},{"$f":"SP5_Sprint!O94","v":"Fahrer Wolfgang Schertler mit der StartNr. 93 ,hat erfolgreich die Prüfung SP5 absolviert. Zeit: "},{"$f":"SP5_Sprint!P94","v":"00:00:01.200"},{"$f":"SP5_Sprint!R94","v":"x"}]
[{"$f":"SP5_Sprint!G95","v":"00:00:30.320"},{"$f":"SP5_Sprint!H95","v":"00:00:00.680"},{"$f":"SP5_Sprint!O95","v":"Fahrer Thomas Katzensteiner mit der StartNr. 94 ,hat erfolgreich die Prüfung SP5 absolviert. Zeit: -"},{"$f":"SP5_Sprint!P95","v":"00:00:00.680"},{"$f":"SP5_Sprint!R95","v":"x"}]
[{"$f":"SP5_Sprint!G96","v":"00:00:30.700"},{"$f":"SP5_Sprint!H96","v":"00:00:00.300"},{"$f":"SP5_Sprint!O96","v":"Fahrer Hagen Hackenberg mit der StartNr. 95 ,hat erfolgreich die Prüfung SP5 absolviert. Zeit: -"},{"$f":"SP5_Sprint!P96","v":"00:00:00.300"},{"$f":"SP5_Sprint!R96","v":"x"}]
[{"$f":"SP5_Sprint!G97","v":"00:00:30.110"},{"$f":"SP5_Sprint!H97","v":"00:00:00.890"},{"$f":"SP5_Sprint!O97","v":"Fahrer Oliver Dietz mit der StartNr. 96 ,hat erfolgreich die Prüfung SP5 absolviert. Zeit: -"},{"$f":"SP5_Sprint!P97","v":"00:00:00.890"},{"$f":"SP5_Sprint!R97","v":"x"}]
[{"$f":"SP5_Sprint!G98","v":"00:00:29.290"},{"$f":"SP5_Sprint!H98","v":"00:00:01.710"},{"$f":"SP5_Sprint!O98","v":"Fahrer Horst Kempf mit der StartNr. 97 ,hat erfolgreich die Prüfung SP5 absolviert. Zeit: -"},{"$f":"SP5_Sprint!P98","v":"00:00:01.710"},{"$f":"SP5_Sprint!R98","v":"x"}]
[{"$f":"SP5_Sprint!G99","v":"00:00:34.700"},{"$f":"SP5_Sprint!H99","v":"00:00:03.700"},{"$f":"SP5_Sprint!O99","v":"Fahrer Detlev Pauer mit der StartNr. 98 ,hat erfolgreich die Prüfung SP5 absolviert. Zeit: "},{"$f":"SP5_Sprint!P99","v":"00:00:03.700"},{"$f":"SP5_Sprint!R99","v":"x"}]
[{"$f":"SP5_Sprint!G100","v":"00:00:30.290"},{"$f":"SP5_Sprint!H100","v":"00:00:00.710"},{"$f":"SP5_Sprint!O100","v":"Fahrer Dirk Velte mit der StartNr. 99 ,hat erfolgreich die Prüfung SP5 absolviert. Zeit: -"},{"$f":"SP5_Sprint!P100","v":"00:00:00.710"},{"$f":"SP5_Sprint!R100","v":"x"}]
[{"$f":"SP5_Sprint!G101","v":"00:00:29.970"},{"$f":"SP5_Sprint!H101","v":"00:00:01.030"},{"$f":"SP5_Sprint!O101","v":"Fahrer Thorsten Krack mit der StartNr. 100 ,hat erfolgreich die Prüfung SP5 absolviert. Zeit: -"},{"$f":"SP5_Sprint!P101","v":"00:00:01.030"},{"$f":"SP5_Sprint!R101","v":"x"}]
[{"$f":"SP5_Sprint!G102","v":"00:00:34.830"},{"$f":"SP5_Sprint!H102","v":"00:00:03.830"},{"$f":"SP5_Sprint!O102","v":"Fahrer Christian Wittek mit der StartNr. 101 ,hat erfolgreich die Prüfung SP5 absolviert. Zeit: "},{"$f":"SP5_Sprint!P102","v":"00:00:03.830"},{"$f":"SP5_Sprint!R102","v":"x"}]
[{"$f":"SP5_Sprint!G103","v":"00:00:31.510"},{"$f":"SP5_Sprint!H103","v":"00:00:00.510"},{"$f":"SP5_Sprint!O103","v":"Fahrer Benjamin Hix mit der StartNr. 102 ,hat erfolgreich die Prüfung SP5 absolviert. Zeit: "},{"$f":"SP5_Sprint!P103","v":"00:00:00.510"},{"$f":"SP5_Sprint!R103","v":"x"}]

{"sheet":"Export_SP8","index":13,"n_rows":102,"n_cols":5,"rows_kept":102,"cut":false,"hidden":false,"merged":[]}
[{"$f":"SP8_Sprint!G2","v":""},{"$f":"SP8_Sprint!H2","v":{"$error":"#VALUE!"}},{"$f":"SP8_Sprint!N2","v":""},{"$f":"SP8_Sprint!O2","v":""},{"$f":"SP8_Sprint!R2","v":0}]
[{"$f":"SP8_Sprint!G3","v":""},{"$f":"SP8_Sprint!H3","v":{"$error":"#VALUE!"}},{"$f":"SP8_Sprint!N3","v":""},{"$f":"SP8_Sprint!O3","v":""},{"$f":"SP8_Sprint!R3","v":0}]
[{"$f":"SP8_Sprint!G4","v":""},{"$f":"SP8_Sprint!H4","v":{"$error":"#VALUE!"}},{"$f":"SP8_Sprint!N4","v":""},{"$f":"SP8_Sprint!O4","v":""},{"$f":"SP8_Sprint!R4","v":0}]
[{"$f":"SP8_Sprint!G5","v":""},{"$f":"SP8_Sprint!H5","v":{"$error":"#VALUE!"}},{"$f":"SP8_Sprint!N5","v":""},{"$f":"SP8_Sprint!O5","v":""},{"$f":"SP8_Sprint!R5","v":0}]
[{"$f":"SP8_Sprint!G6","v":""},{"$f":"SP8_Sprint!H6","v":{"$error":"#VALUE!"}},{"$f":"SP8_Sprint!N6","v":""},{"$f":"SP8_Sprint!O6","v":""},{"$f":"SP8_Sprint!R6","v":0}]
[{"$f":"SP8_Sprint!G7","v":""},{"$f":"SP8_Sprint!H7","v":{"$error":"#VALUE!"}},{"$f":"SP8_Sprint!N7","v":""},{"$f":"SP8_Sprint!O7","v":""},{"$f":"SP8_Sprint!R7","v":0}]
[{"$f":"SP8_Sprint!G8","v":""},{"$f":"SP8_Sprint!H8","v":{"$error":"#VALUE!"}},{"$f":"SP8_Sprint!N8","v":""},{"$f":"SP8_Sprint!O8","v":""},{"$f":"SP8_Sprint!R8","v":0}]
[{"$f":"SP8_Sprint!G9","v":""},{"$f":"SP8_Sprint!H9","v":{"$error":"#VALUE!"}},{"$f":"SP8_Sprint!N9","v":""},{"$f":"SP8_Sprint!O9","v":""},{"$f":"SP8_Sprint!R9","v":0}]
[{"$f":"SP8_Sprint!G10","v":""},{"$f":"SP8_Sprint!H10","v":{"$error":"#VALUE!"}},{"$f":"SP8_Sprint!N10","v":""},{"$f":"SP8_Sprint!O10","v":""},{"$f":"SP8_Sprint!R10","v":0}]
[{"$f":"SP8_Sprint!G11","v":""},{"$f":"SP8_Sprint!H11","v":{"$error":"#VALUE!"}},{"$f":"SP8_Sprint!N11","v":""},{"$f":"SP8_Sprint!O11","v":""},{"$f":"SP8_Sprint!R11","v":0}]
[{"$f":"SP8_Sprint!G12","v":""},{"$f":"SP8_Sprint!H12","v":{"$error":"#VALUE!"}},{"$f":"SP8_Sprint!N12","v":""},{"$f":"SP8_Sprint!O12","v":""},{"$f":"SP8_Sprint!R12","v":0}]
[{"$f":"SP8_Sprint!G13","v":""},{"$f":"SP8_Sprint!H13","v":{"$error":"#VALUE!"}},{"$f":"SP8_Sprint!N13","v":""},{"$f":"SP8_Sprint!O13","v":""},{"$f":"SP8_Sprint!R13","v":0}]
[{"$f":"SP8_Sprint!G14","v":""},{"$f":"SP8_Sprint!H14","v":{"$error":"#VALUE!"}},{"$f":"SP8_Sprint!N14","v":""},{"$f":"SP8_Sprint!O14","v":""},{"$f":"SP8_Sprint!R14","v":0}]
[{"$f":"SP8_Sprint!G15","v":""},{"$f":"SP8_Sprint!H15","v":{"$error":"#VALUE!"}},{"$f":"SP8_Sprint!N15","v":""},{"$f":"SP8_Sprint!O15","v":""},{"$f":"SP8_Sprint!R15","v":0}]
[{"$f":"SP8_Sprint!G16","v":""},{"$f":"SP8_Sprint!H16","v":{"$error":"#VALUE!"}},{"$f":"SP8_Sprint!N16","v":""},{"$f":"SP8_Sprint!O16","v":""},{"$f":"SP8_Sprint!R16","v":0}]
[{"$f":"SP8_Sprint!G17","v":""},{"$f":"SP8_Sprint!H17","v":{"$error":"#VALUE!"}},{"$f":"SP8_Sprint!N17","v":""},{"$f":"SP8_Sprint!O17","v":""},{"$f":"SP8_Sprint!R17","v":0}]
[{"$f":"SP8_Sprint!G18","v":""},{"$f":"SP8_Sprint!H18","v":{"$error":"#VALUE!"}},{"$f":"SP8_Sprint!N18","v":""},{"$f":"SP8_Sprint!O18","v":""},{"$f":"SP8_Sprint!R18","v":0}]
[{"$f":"SP8_Sprint!G19","v":""},{"$f":"SP8_Sprint!H19","v":{"$error":"#VALUE!"}},{"$f":"SP8_Sprint!N19","v":""},{"$f":"SP8_Sprint!O19","v":""},{"$f":"SP8_Sprint!R19","v":0}]
[{"$f":"SP8_Sprint!G20","v":""},{"$f":"SP8_Sprint!H20","v":{"$error":"#VALUE!"}},{"$f":"SP8_Sprint!N20","v":""},{"$f":"SP8_Sprint!O20","v":""},{"$f":"SP8_Sprint!R20","v":0}]
[{"$f":"SP8_Sprint!G21","v":""},{"$f":"SP8_Sprint!H21","v":{"$error":"#VALUE!"}},{"$f":"SP8_Sprint!N21","v":""},{"$f":"SP8_Sprint!O21","v":""},{"$f":"SP8_Sprint!R21","v":0}]
[{"$f":"SP8_Sprint!G22","v":""},{"$f":"SP8_Sprint!H22","v":{"$error":"#VALUE!"}},{"$f":"SP8_Sprint!N22","v":""},{"$f":"SP8_Sprint!O22","v":""},{"$f":"SP8_Sprint!R22","v":0}]
[{"$f":"SP8_Sprint!G23","v":""},{"$f":"SP8_Sprint!H23","v":{"$error":"#VALUE!"}},{"$f":"SP8_Sprint!N23","v":""},{"$f":"SP8_Sprint!O23","v":""},{"$f":"SP8_Sprint!R23","v":0}]
[{"$f":"SP8_Sprint!G24","v":""},{"$f":"SP8_Sprint!H24","v":{"$error":"#VALUE!"}},{"$f":"SP8_Sprint!N24","v":""},{"$f":"SP8_Sprint!O24","v":""},{"$f":"SP8_Sprint!R24","v":0}]
[{"$f":"SP8_Sprint!G25","v":""},{"$f":"SP8_Sprint!H25","v":{"$error":"#VALUE!"}},{"$f":"SP8_Sprint!N25","v":""},{"$f":"SP8_Sprint!O25","v":""},{"$f":"SP8_Sprint!R25","v":0}]
[{"$f":"SP8_Sprint!G26","v":""},{"$f":"SP8_Sprint!H26","v":{"$error":"#VALUE!"}},{"$f":"SP8_Sprint!N26","v":""},{"$f":"SP8_Sprint!O26","v":""},{"$f":"SP8_Sprint!R26","v":0}]
[{"$f":"SP8_Sprint!G27","v":""},{"$f":"SP8_Sprint!H27","v":{"$error":"#VALUE!"}},{"$f":"SP8_Sprint!N27","v":""},{"$f":"SP8_Sprint!O27","v":""},{"$f":"SP8_Sprint!R27","v":0}]
[{"$f":"SP8_Sprint!G28","v":""},{"$f":"SP8_Sprint!H28","v":{"$error":"#VALUE!"}},{"$f":"SP8_Sprint!N28","v":""},{"$f":"SP8_Sprint!O28","v":""},{"$f":"SP8_Sprint!R28","v":0}]
[{"$f":"SP8_Sprint!G29","v":""},{"$f":"SP8_Sprint!H29","v":{"$error":"#VALUE!"}},{"$f":"SP8_Sprint!N29","v":""},{"$f":"SP8_Sprint!O29","v":""},{"$f":"SP8_Sprint!R29","v":0}]
[{"$f":"SP8_Sprint!G30","v":""},{"$f":"SP8_Sprint!H30","v":{"$error":"#VALUE!"}},{"$f":"SP8_Sprint!N30","v":""},{"$f":"SP8_Sprint!O30","v":""},{"$f":"SP8_Sprint!R30","v":0}]
[{"$f":"SP8_Sprint!G31","v":""},{"$f":"SP8_Sprint!H31","v":{"$error":"#VALUE!"}},{"$f":"SP8_Sprint!N31","v":""},{"$f":"SP8_Sprint!O31","v":""},{"$f":"SP8_Sprint!R31","v":0}]
[{"$f":"SP8_Sprint!G32","v":""},{"$f":"SP8_Sprint!H32","v":{"$error":"#VALUE!"}},{"$f":"SP8_Sprint!N32","v":""},{"$f":"SP8_Sprint!O32","v":""},{"$f":"SP8_Sprint!R32","v":0}]
[{"$f":"SP8_Sprint!G33","v":""},{"$f":"SP8_Sprint!H33","v":{"$error":"#VALUE!"}},{"$f":"SP8_Sprint!N33","v":""},{"$f":"SP8_Sprint!O33","v":""},{"$f":"SP8_Sprint!R33","v":0}]
[{"$f":"SP8_Sprint!G34","v":""},{"$f":"SP8_Sprint!H34","v":{"$error":"#VALUE!"}},{"$f":"SP8_Sprint!N34","v":""},{"$f":"SP8_Sprint!O34","v":""},{"$f":"SP8_Sprint!R34","v":0}]
[{"$f":"SP8_Sprint!G35","v":""},{"$f":"SP8_Sprint!H35","v":{"$error":"#VALUE!"}},{"$f":"SP8_Sprint!N35","v":""},{"$f":"SP8_Sprint!O35","v":""},{"$f":"SP8_Sprint!R35","v":0}]
[{"$f":"SP8_Sprint!G36","v":""},{"$f":"SP8_Sprint!H36","v":{"$error":"#VALUE!"}},{"$f":"SP8_Sprint!N36","v":""},{"$f":"SP8_Sprint!O36","v":""},{"$f":"SP8_Sprint!R36","v":0}]
[{"$f":"SP8_Sprint!G37","v":""},{"$f":"SP8_Sprint!H37","v":{"$error":"#VALUE!"}},{"$f":"SP8_Sprint!N37","v":""},{"$f":"SP8_Sprint!O37","v":""},{"$f":"SP8_Sprint!R37","v":0}]
[{"$f":"SP8_Sprint!G38","v":""},{"$f":"SP8_Sprint!H38","v":{"$error":"#VALUE!"}},{"$f":"SP8_Sprint!N38","v":""},{"$f":"SP8_Sprint!O38","v":""},{"$f":"SP8_Sprint!R38","v":0}]
[{"$f":"SP8_Sprint!G39","v":""},{"$f":"SP8_Sprint!H39","v":{"$error":"#VALUE!"}},{"$f":"SP8_Sprint!N39","v":""},{"$f":"SP8_Sprint!O39","v":""},{"$f":"SP8_Sprint!R39","v":0}]
[{"$f":"SP8_Sprint!G40","v":""},{"$f":"SP8_Sprint!H40","v":{"$error":"#VALUE!"}},{"$f":"SP8_Sprint!N40","v":""},{"$f":"SP8_Sprint!O40","v":""},{"$f":"SP8_Sprint!R40","v":0}]
[{"$f":"SP8_Sprint!G41","v":""},{"$f":"SP8_Sprint!H41","v":{"$error":"#VALUE!"}},{"$f":"SP8_Sprint!N41","v":""},{"$f":"SP8_Sprint!O41","v":""},{"$f":"SP8_Sprint!R41","v":0}]
[{"$f":"SP8_Sprint!G42","v":""},{"$f":"SP8_Sprint!H42","v":{"$error":"#VALUE!"}},{"$f":"SP8_Sprint!N42","v":""},{"$f":"SP8_Sprint!O42","v":""},{"$f":"SP8_Sprint!R42","v":0}]
[{"$f":"SP8_Sprint!G43","v":""},{"$f":"SP8_Sprint!H43","v":{"$error":"#VALUE!"}},{"$f":"SP8_Sprint!N43","v":""},{"$f":"SP8_Sprint!O43","v":""},{"$f":"SP8_Sprint!R43","v":0}]
[{"$f":"SP8_Sprint!G44","v":""},{"$f":"SP8_Sprint!H44","v":{"$error":"#VALUE!"}},{"$f":"SP8_Sprint!N44","v":""},{"$f":"SP8_Sprint!O44","v":""},{"$f":"SP8_Sprint!R44","v":0}]
[{"$f":"SP8_Sprint!G45","v":""},{"$f":"SP8_Sprint!H45","v":{"$error":"#VALUE!"}},{"$f":"SP8_Sprint!N45","v":""},{"$f":"SP8_Sprint!O45","v":""},{"$f":"SP8_Sprint!R45","v":0}]
[{"$f":"SP8_Sprint!G46","v":""},{"$f":"SP8_Sprint!H46","v":{"$error":"#VALUE!"}},{"$f":"SP8_Sprint!N46","v":""},{"$f":"SP8_Sprint!O46","v":""},{"$f":"SP8_Sprint!R46","v":0}]
[{"$f":"SP8_Sprint!G47","v":""},{"$f":"SP8_Sprint!H47","v":{"$error":"#VALUE!"}},{"$f":"SP8_Sprint!N47","v":""},{"$f":"SP8_Sprint!O47","v":""},{"$f":"SP8_Sprint!R47","v":0}]
[{"$f":"SP8_Sprint!G48","v":""},{"$f":"SP8_Sprint!H48","v":{"$error":"#VALUE!"}},{"$f":"SP8_Sprint!N48","v":""},{"$f":"SP8_Sprint!O48","v":""},{"$f":"SP8_Sprint!R48","v":0}]
[{"$f":"SP8_Sprint!G49","v":""},{"$f":"SP8_Sprint!H49","v":{"$error":"#VALUE!"}},{"$f":"SP8_Sprint!N49","v":""},{"$f":"SP8_Sprint!O49","v":""},{"$f":"SP8_Sprint!R49","v":0}]
[{"$f":"SP8_Sprint!G50","v":""},{"$f":"SP8_Sprint!H50","v":{"$error":"#VALUE!"}},{"$f":"SP8_Sprint!N50","v":""},{"$f":"SP8_Sprint!O50","v":""},{"$f":"SP8_Sprint!R50","v":0}]
[{"$f":"SP8_Sprint!G51","v":""},{"$f":"SP8_Sprint!H51","v":{"$error":"#VALUE!"}},{"$f":"SP8_Sprint!N51","v":""},{"$f":"SP8_Sprint!O51","v":""},{"$f":"SP8_Sprint!R51","v":0}]
[{"$f":"SP8_Sprint!G52","v":""},{"$f":"SP8_Sprint!H52","v":{"$error":"#VALUE!"}},{"$f":"SP8_Sprint!N52","v":""},{"$f":"SP8_Sprint!O52","v":""},{"$f":"SP8_Sprint!R52","v":0}]
[{"$f":"SP8_Sprint!G53","v":""},{"$f":"SP8_Sprint!H53","v":{"$error":"#VALUE!"}},{"$f":"SP8_Sprint!N53","v":""},{"$f":"SP8_Sprint!O53","v":""},{"$f":"SP8_Sprint!R53","v":0}]
[{"$f":"SP8_Sprint!G54","v":""},{"$f":"SP8_Sprint!H54","v":{"$error":"#VALUE!"}},{"$f":"SP8_Sprint!N54","v":""},{"$f":"SP8_Sprint!O54","v":""},{"$f":"SP8_Sprint!R54","v":0}]
[{"$f":"SP8_Sprint!G55","v":""},{"$f":"SP8_Sprint!H55","v":{"$error":"#VALUE!"}},{"$f":"SP8_Sprint!N55","v":""},{"$f":"SP8_Sprint!O55","v":""},{"$f":"SP8_Sprint!R55","v":0}]
[{"$f":"SP8_Sprint!G56","v":""},{"$f":"SP8_Sprint!H56","v":{"$error":"#VALUE!"}},{"$f":"SP8_Sprint!N56","v":""},{"$f":"SP8_Sprint!O56","v":""},{"$f":"SP8_Sprint!R56","v":0}]
[{"$f":"SP8_Sprint!G57","v":""},{"$f":"SP8_Sprint!H57","v":{"$error":"#VALUE!"}},{"$f":"SP8_Sprint!N57","v":""},{"$f":"SP8_Sprint!O57","v":""},{"$f":"SP8_Sprint!R57","v":0}]
[{"$f":"SP8_Sprint!G58","v":""},{"$f":"SP8_Sprint!H58","v":{"$error":"#VALUE!"}},{"$f":"SP8_Sprint!N58","v":""},{"$f":"SP8_Sprint!O58","v":""},{"$f":"SP8_Sprint!R58","v":0}]
[{"$f":"SP8_Sprint!G59","v":""},{"$f":"SP8_Sprint!H59","v":{"$error":"#VALUE!"}},{"$f":"SP8_Sprint!N59","v":""},{"$f":"SP8_Sprint!O59","v":""},{"$f":"SP8_Sprint!R59","v":0}]
[{"$f":"SP8_Sprint!G60","v":""},{"$f":"SP8_Sprint!H60","v":{"$error":"#VALUE!"}},{"$f":"SP8_Sprint!N60","v":""},{"$f":"SP8_Sprint!O60","v":""},{"$f":"SP8_Sprint!R60","v":0}]
[{"$f":"SP8_Sprint!G61","v":""},{"$f":"SP8_Sprint!H61","v":{"$error":"#VALUE!"}},{"$f":"SP8_Sprint!N61","v":""},{"$f":"SP8_Sprint!O61","v":""},{"$f":"SP8_Sprint!R61","v":0}]
[{"$f":"SP8_Sprint!G62","v":""},{"$f":"SP8_Sprint!H62","v":{"$error":"#VALUE!"}},{"$f":"SP8_Sprint!N62","v":""},{"$f":"SP8_Sprint!O62","v":""},{"$f":"SP8_Sprint!R62","v":0}]
[{"$f":"SP8_Sprint!G63","v":""},{"$f":"SP8_Sprint!H63","v":{"$error":"#VALUE!"}},{"$f":"SP8_Sprint!N63","v":""},{"$f":"SP8_Sprint!O63","v":""},{"$f":"SP8_Sprint!R63","v":0}]
[{"$f":"SP8_Sprint!G64","v":""},{"$f":"SP8_Sprint!H64","v":{"$error":"#VALUE!"}},{"$f":"SP8_Sprint!N64","v":""},{"$f":"SP8_Sprint!O64","v":""},{"$f":"SP8_Sprint!R64","v":0}]
[{"$f":"SP8_Sprint!G65","v":""},{"$f":"SP8_Sprint!H65","v":{"$error":"#VALUE!"}},{"$f":"SP8_Sprint!N65","v":""},{"$f":"SP8_Sprint!O65","v":""},{"$f":"SP8_Sprint!R65","v":0}]
[{"$f":"SP8_Sprint!G66","v":""},{"$f":"SP8_Sprint!H66","v":{"$error":"#VALUE!"}},{"$f":"SP8_Sprint!N66","v":""},{"$f":"SP8_Sprint!O66","v":""},{"$f":"SP8_Sprint!R66","v":0}]
[{"$f":"SP8_Sprint!G67","v":""},{"$f":"SP8_Sprint!H67","v":{"$error":"#VALUE!"}},{"$f":"SP8_Sprint!N67","v":""},{"$f":"SP8_Sprint!O67","v":""},{"$f":"SP8_Sprint!R67","v":0}]
[{"$f":"SP8_Sprint!G68","v":""},{"$f":"SP8_Sprint!H68","v":{"$error":"#VALUE!"}},{"$f":"SP8_Sprint!N68","v":""},{"$f":"SP8_Sprint!O68","v":""},{"$f":"SP8_Sprint!R68","v":0}]
[{"$f":"SP8_Sprint!G69","v":""},{"$f":"SP8_Sprint!H69","v":{"$error":"#VALUE!"}},{"$f":"SP8_Sprint!N69","v":""},{"$f":"SP8_Sprint!O69","v":""},{"$f":"SP8_Sprint!R69","v":0}]
[{"$f":"SP8_Sprint!G70","v":""},{"$f":"SP8_Sprint!H70","v":{"$error":"#VALUE!"}},{"$f":"SP8_Sprint!N70","v":""},{"$f":"SP8_Sprint!O70","v":""},{"$f":"SP8_Sprint!R70","v":0}]
[{"$f":"SP8_Sprint!G71","v":""},{"$f":"SP8_Sprint!H71","v":{"$error":"#VALUE!"}},{"$f":"SP8_Sprint!N71","v":""},{"$f":"SP8_Sprint!O71","v":""},{"$f":"SP8_Sprint!R71","v":0}]
[{"$f":"SP8_Sprint!G72","v":""},{"$f":"SP8_Sprint!H72","v":{"$error":"#VALUE!"}},{"$f":"SP8_Sprint!N72","v":""},{"$f":"SP8_Sprint!O72","v":""},{"$f":"SP8_Sprint!R72","v":0}]
[{"$f":"SP8_Sprint!G73","v":""},{"$f":"SP8_Sprint!H73","v":{"$error":"#VALUE!"}},{"$f":"SP8_Sprint!N73","v":""},{"$f":"SP8_Sprint!O73","v":""},{"$f":"SP8_Sprint!R73","v":0}]
[{"$f":"SP8_Sprint!G74","v":""},{"$f":"SP8_Sprint!H74","v":{"$error":"#VALUE!"}},{"$f":"SP8_Sprint!N74","v":""},{"$f":"SP8_Sprint!O74","v":""},{"$f":"SP8_Sprint!R74","v":0}]
[{"$f":"SP8_Sprint!G75","v":""},{"$f":"SP8_Sprint!H75","v":{"$error":"#VALUE!"}},{"$f":"SP8_Sprint!N75","v":""},{"$f":"SP8_Sprint!O75","v":""},{"$f":"SP8_Sprint!R75","v":0}]
[{"$f":"SP8_Sprint!G76","v":""},{"$f":"SP8_Sprint!H76","v":{"$error":"#VALUE!"}},{"$f":"SP8_Sprint!N76","v":""},{"$f":"SP8_Sprint!O76","v":""},{"$f":"SP8_Sprint!R76","v":0}]
[{"$f":"SP8_Sprint!G77","v":""},{"$f":"SP8_Sprint!H77","v":{"$error":"#VALUE!"}},{"$f":"SP8_Sprint!N77","v":""},{"$f":"SP8_Sprint!O77","v":""},{"$f":"SP8_Sprint!R77","v":0}]
[{"$f":"SP8_Sprint!G78","v":""},{"$f":"SP8_Sprint!H78","v":{"$error":"#VALUE!"}},{"$f":"SP8_Sprint!N78","v":""},{"$f":"SP8_Sprint!O78","v":""},{"$f":"SP8_Sprint!R78","v":0}]
[{"$f":"SP8_Sprint!G79","v":""},{"$f":"SP8_Sprint!H79","v":{"$error":"#VALUE!"}},{"$f":"SP8_Sprint!N79","v":""},{"$f":"SP8_Sprint!O79","v":""},{"$f":"SP8_Sprint!R79","v":0}]
[{"$f":"SP8_Sprint!G80","v":""},{"$f":"SP8_Sprint!H80","v":{"$error":"#VALUE!"}},{"$f":"SP8_Sprint!N80","v":""},{"$f":"SP8_Sprint!O80","v":""},{"$f":"SP8_Sprint!R80","v":0}]
[{"$f":"SP8_Sprint!G81","v":""},{"$f":"SP8_Sprint!H81","v":{"$error":"#VALUE!"}},{"$f":"SP8_Sprint!N81","v":""},{"$f":"SP8_Sprint!O81","v":""},{"$f":"SP8_Sprint!R81","v":0}]
[{"$f":"SP8_Sprint!G82","v":""},{"$f":"SP8_Sprint!H82","v":{"$error":"#VALUE!"}},{"$f":"SP8_Sprint!N82","v":""},{"$f":"SP8_Sprint!O82","v":""},{"$f":"SP8_Sprint!R82","v":0}]
[{"$f":"SP8_Sprint!G83","v":""},{"$f":"SP8_Sprint!H83","v":{"$error":"#VALUE!"}},{"$f":"SP8_Sprint!N83","v":""},{"$f":"SP8_Sprint!O83","v":""},{"$f":"SP8_Sprint!R83","v":0}]
[{"$f":"SP8_Sprint!G84","v":""},{"$f":"SP8_Sprint!H84","v":{"$error":"#VALUE!"}},{"$f":"SP8_Sprint!N84","v":""},{"$f":"SP8_Sprint!O84","v":""},{"$f":"SP8_Sprint!R84","v":0}]
[{"$f":"SP8_Sprint!G85","v":""},{"$f":"SP8_Sprint!H85","v":{"$error":"#VALUE!"}},{"$f":"SP8_Sprint!N85","v":""},{"$f":"SP8_Sprint!O85","v":""},{"$f":"SP8_Sprint!R85","v":0}]
[{"$f":"SP8_Sprint!G86","v":""},{"$f":"SP8_Sprint!H86","v":{"$error":"#VALUE!"}},{"$f":"SP8_Sprint!N86","v":""},{"$f":"SP8_Sprint!O86","v":""},{"$f":"SP8_Sprint!R86","v":0}]
[{"$f":"SP8_Sprint!G87","v":""},{"$f":"SP8_Sprint!H87","v":{"$error":"#VALUE!"}},{"$f":"SP8_Sprint!N87","v":""},{"$f":"SP8_Sprint!O87","v":""},{"$f":"SP8_Sprint!R87","v":0}]
[{"$f":"SP8_Sprint!G88","v":""},{"$f":"SP8_Sprint!H88","v":{"$error":"#VALUE!"}},{"$f":"SP8_Sprint!N88","v":""},{"$f":"SP8_Sprint!O88","v":""},{"$f":"SP8_Sprint!R88","v":0}]
[{"$f":"SP8_Sprint!G89","v":""},{"$f":"SP8_Sprint!H89","v":{"$error":"#VALUE!"}},{"$f":"SP8_Sprint!N89","v":""},{"$f":"SP8_Sprint!O89","v":""},{"$f":"SP8_Sprint!R89","v":0}]
[{"$f":"SP8_Sprint!G90","v":""},{"$f":"SP8_Sprint!H90","v":{"$error":"#VALUE!"}},{"$f":"SP8_Sprint!N90","v":""},{"$f":"SP8_Sprint!O90","v":""},{"$f":"SP8_Sprint!R90","v":0}]
[{"$f":"SP8_Sprint!G91","v":""},{"$f":"SP8_Sprint!H91","v":{"$error":"#VALUE!"}},{"$f":"SP8_Sprint!N91","v":""},{"$f":"SP8_Sprint!O91","v":""},{"$f":"SP8_Sprint!R91","v":0}]
[{"$f":"SP8_Sprint!G92","v":""},{"$f":"SP8_Sprint!H92","v":{"$error":"#VALUE!"}},{"$f":"SP8_Sprint!N92","v":""},{"$f":"SP8_Sprint!O92","v":""},{"$f":"SP8_Sprint!R92","v":0}]
[{"$f":"SP8_Sprint!G93","v":""},{"$f":"SP8_Sprint!H93","v":{"$error":"#VALUE!"}},{"$f":"SP8_Sprint!N93","v":""},{"$f":"SP8_Sprint!O93","v":""},{"$f":"SP8_Sprint!R93","v":0}]
[{"$f":"SP8_Sprint!G94","v":""},{"$f":"SP8_Sprint!H94","v":{"$error":"#VALUE!"}},{"$f":"SP8_Sprint!N94","v":""},{"$f":"SP8_Sprint!O94","v":""},{"$f":"SP8_Sprint!R94","v":0}]
[{"$f":"SP8_Sprint!G95","v":""},{"$f":"SP8_Sprint!H95","v":{"$error":"#VALUE!"}},{"$f":"SP8_Sprint!N95","v":""},{"$f":"SP8_Sprint!O95","v":""},{"$f":"SP8_Sprint!R95","v":0}]
[{"$f":"SP8_Sprint!G96","v":""},{"$f":"SP8_Sprint!H96","v":{"$error":"#VALUE!"}},{"$f":"SP8_Sprint!N96","v":""},{"$f":"SP8_Sprint!O96","v":""},{"$f":"SP8_Sprint!R96","v":0}]
[{"$f":"SP8_Sprint!G97","v":""},{"$f":"SP8_Sprint!H97","v":{"$error":"#VALUE!"}},{"$f":"SP8_Sprint!N97","v":""},{"$f":"SP8_Sprint!O97","v":""},{"$f":"SP8_Sprint!R97","v":0}]
[{"$f":"SP8_Sprint!G98","v":""},{"$f":"SP8_Sprint!H98","v":{"$error":"#VALUE!"}},{"$f":"SP8_Sprint!N98","v":""},{"$f":"SP8_Sprint!O98","v":""},{"$f":"SP8_Sprint!R98","v":0}]
[{"$f":"SP8_Sprint!G99","v":""},{"$f":"SP8_Sprint!H99","v":{"$error":"#VALUE!"}},{"$f":"SP8_Sprint!N99","v":""},{"$f":"SP8_Sprint!O99","v":""},{"$f":"SP8_Sprint!R99","v":0}]
[{"$f":"SP8_Sprint!G100","v":""},{"$f":"SP8_Sprint!H100","v":{"$error":"#VALUE!"}},{"$f":"SP8_Sprint!N100","v":""},{"$f":"SP8_Sprint!O100","v":""},{"$f":"SP8_Sprint!R100","v":0}]
[{"$f":"SP8_Sprint!G101","v":""},{"$f":"SP8_Sprint!H101","v":{"$error":"#VALUE!"}},{"$f":"SP8_Sprint!N101","v":""},{"$f":"SP8_Sprint!O101","v":""}]
[{"$f":"SP8_Sprint!G102","v":""},{"$f":"SP8_Sprint!H102","v":{"$error":"#VALUE!"}},{"$f":"SP8_Sprint!N102","v":""},{"$f":"SP8_Sprint!O102","v":""}]
[{"$f":"SP8_Sprint!G103","v":""},{"$f":"SP8_Sprint!H103","v":{"$error":"#VALUE!"}},{"$f":"SP8_Sprint!N103","v":""},{"$f":"SP8_Sprint!O103","v":""}]

{"sheet":"Export_SP6","index":14,"n_rows":102,"n_cols":8,"rows_kept":102,"cut":false,"hidden":false,"merged":[]}
[{"$f":"'SP6'!I3","v":"12:45:00,00"},{"$f":"'SP6'!J3","v":"12:47:24.830"},{"$f":"'SP6'!K3","v":"00:00:00"},{"$f":"'SP6'!L3","v":"00:02:24.830"},{"$f":"'SP6'!M3","v":"00:00:00.170"},{"$f":"'SP6'!S3","v":"Fahrer Christian Jäger mit der StartNr. 1 ,hat erfolgreich die Prüfung SP6 absolviert. Zeit: -"},{"$f":"'SP6'!T3","v":"00:00:00.170"},{"$f":"'SP6'!V3","v":1}]
[{"$f":"'SP6'!I4","v":"12:54:00,00"},{"$f":"'SP6'!J4","v":"12:56:25.740"},{"$f":"'SP6'!K4","v":"00:00:00"},{"$f":"'SP6'!L4","v":"00:02:25.740"},{"$f":"'SP6'!M4","v":"00:00:00.740"},{"$f":"'SP6'!S4","v":"Fahrer Daniel Rinck mit der StartNr. 2 ,hat erfolgreich die Prüfung SP6 absolviert. Zeit: "},{"$f":"'SP6'!T4","v":"00:00:00.740"},{"$f":"'SP6'!V4","v":1}]
[{"$f":"'SP6'!I5","v":"12:42:00"},{"$f":"'SP6'!J5","v":"12:44:25.770"},{"$f":"'SP6'!K5","v":"00:00:00"},{"$f":"'SP6'!L5","v":"00:02:25.770"},{"$f":"'SP6'!M5","v":"00:00:00.770"},{"$f":"'SP6'!S5","v":"Fahrer Malte Proff-Klein mit der StartNr. 3 ,hat erfolgreich die Prüfung SP6 absolviert. Zeit: "},{"$f":"'SP6'!T5","v":"00:00:00.770"},{"$f":"'SP6'!V5","v":1}]
[{"$f":"'SP6'!I6","v":"12:43:00"},{"$f":"'SP6'!J6","v":"12:45:24.680"},{"$f":"'SP6'!K6","v":"00:00:00"},{"$f":"'SP6'!L6","v":"00:02:24.680"},{"$f":"'SP6'!M6","v":"00:00:00.320"},{"$f":"'SP6'!S6","v":"Fahrer Dietmar Siemssen mit der StartNr. 4 ,hat erfolgreich die Prüfung SP6 absolviert. Zeit: -"},{"$f":"'SP6'!T6","v":"00:00:00.320"},{"$f":"'SP6'!V6","v":"x"}]
[{"$f":"'SP6'!I7","v":"12:47:00,00"},{"$f":"'SP6'!J7","v":"12:49:30.060"},{"$f":"'SP6'!K7","v":"00:00:00"},{"$f":"'SP6'!L7","v":"00:02:30.060"},{"$f":"'SP6'!M7","v":"00:00:05.060"},{"$f":"'SP6'!S7","v":"Fahrer Franz-Michael Hartmann mit der StartNr. 5 ,hat erfolgreich die Prüfung SP6 absolviert. Zeit: "},{"$f":"'SP6'!T7","v":"00:00:05.060"},{"$f":"'SP6'!V7","v":1}]
[{"$f":"'SP6'!I8","v":"12:41:00"},{"$f":"'SP6'!J8","v":"12:43:25.360"},{"$f":"'SP6'!K8","v":"00:00:00"},{"$f":"'SP6'!L8","v":"00:02:25.360"},{"$f":"'SP6'!M8","v":"00:00:00.360"},{"$f":"'SP6'!S8","v":"Fahrer Christoph Schroer mit der StartNr. 6 ,hat erfolgreich die Prüfung SP6 absolviert. Zeit: "},{"$f":"'SP6'!T8","v":"00:00:00.360"},{"$f":"'SP6'!V8","v":1}]
[{"$f":"'SP6'!I9","v":"12:52:00,00"},{"$f":"'SP6'!J9","v":"12:54:16.250"},{"$f":"'SP6'!K9","v":"00:00:00"},{"$f":"'SP6'!L9","v":"00:02:16.250"},{"$f":"'SP6'!M9","v":"00:00:08.750"},{"$f":"'SP6'!S9","v":"Fahrer Jochen Artzinger-Bolten mit der StartNr. 7 ,hat erfolgreich die Prüfung SP6 absolviert. Zeit: -"},{"$f":"'SP6'!T9","v":"00:00:08.750"},{"$f":"'SP6'!V9","v":1}]
[{"$f":"'SP6'!I10","v":"12:44:00,00"},{"$f":"'SP6'!J10","v":"12:46:26.440"},{"$f":"'SP6'!K10","v":"00:00:00"},{"$f":"'SP6'!L10","v":"00:02:26.440"},{"$f":"'SP6'!M10","v":"00:00:01.440"},{"$f":"'SP6'!S10","v":"Fahrer Friedhelm Eickhorn mit der StartNr. 8 ,hat erfolgreich die Prüfung SP6 absolviert. Zeit: "},{"$f":"'SP6'!T10","v":"00:00:01.440"},{"$f":"'SP6'!V10","v":1}]
[{"$f":"'SP6'!I11","v":"13:19:00,00"},{"$f":"'SP6'!J11","v":"13:21:25.940"},{"$f":"'SP6'!K11","v":"00:00:00"},{"$f":"'SP6'!L11","v":"00:02:25.940"},{"$f":"'SP6'!M11","v":"00:00:00.940"},{"$f":"'SP6'!S11","v":"Fahrer Carsten Reblin mit der StartNr. 9 ,hat erfolgreich die Prüfung SP6 absolviert. Zeit: "},{"$f":"'SP6'!T11","v":"00:00:00.940"},{"$f":"'SP6'!V11","v":1}]
[{"$f":"'SP6'!I12","v":"13:34:00,00"},{"$f":"'SP6'!J12","v":"13:36:28.250"},{"$f":"'SP6'!K12","v":"00:00:00"},{"$f":"'SP6'!L12","v":"00:02:28.250"},{"$f":"'SP6'!M12","v":"00:00:03.250"},{"$f":"'SP6'!S12","v":"Fahrer Dieter Dinges mit der StartNr. 10 ,hat erfolgreich die Prüfung SP6 absolviert. Zeit: "},{"$f":"'SP6'!T12","v":"00:00:03.250"},{"$f":"'SP6'!V12","v":1}]
[{"$f":"'SP6'!I13","v":"12:48:00,00"},{"$f":"'SP6'!J13","v":"12:50:26.120"},{"$f":"'SP6'!K13","v":"00:00:00"},{"$f":"'SP6'!L13","v":"00:02:26.120"},{"$f":"'SP6'!M13","v":"00:00:01.120"},{"$f":"'SP6'!S13","v":"Fahrer Wolfgang Reeh mit der StartNr. 11 ,hat erfolgreich die Prüfung SP6 absolviert. Zeit: "},{"$f":"'SP6'!T13","v":"00:00:01.120"},{"$f":"'SP6'!V13","v":1}]
[{"$f":"'SP6'!I14","v":"12:46:00,00"},{"$f":"'SP6'!J14","v":"12:48:25.380"},{"$f":"'SP6'!K14","v":"00:00:00"},{"$f":"'SP6'!L14","v":"00:02:25.380"},{"$f":"'SP6'!M14","v":"00:00:00.380"},{"$f":"'SP6'!S14","v":"Fahrer Andreas Petry mit der StartNr. 12 ,hat erfolgreich die Prüfung SP6 absolviert. Zeit: "},{"$f":"'SP6'!T14","v":"00:00:00.380"},{"$f":"'SP6'!V14","v":1}]
[{"$f":"'SP6'!I15","v":"12:49:00,00"},{"$f":"'SP6'!J15","v":"12:51:27.540"},{"$f":"'SP6'!K15","v":"00:00:00"},{"$f":"'SP6'!L15","v":"00:02:27.540"},{"$f":"'SP6'!M15","v":"00:00:02.540"},{"$f":"'SP6'!S15","v":"Fahrer Ted Prenzel mit der StartNr. 13 ,hat erfolgreich die Prüfung SP6 absolviert. Zeit: "},{"$f":"'SP6'!T15","v":"00:00:02.540"},{"$f":"'SP6'!V15","v":1}]
[{"$f":"'SP6'!I16","v":"12:50:00,00"},{"$f":"'SP6'!J16","v":"12:52:15.230"},{"$f":"'SP6'!K16","v":"00:00:00"},{"$f":"'SP6'!L16","v":"00:02:15.230"},{"$f":"'SP6'!M16","v":"00:00:09.770"},{"$f":"'SP6'!S16","v":"Fahrer Micha Barsties mit der StartNr. 14 ,hat erfolgreich die Prüfung SP6 absolviert. Zeit: -"},{"$f":"'SP6'!T16","v":"00:00:09.770"},{"$f":"'SP6'!V16","v":1}]
[{"$f":"'SP6'!I17","v":"12:53:00,00"},{"$f":"'SP6'!J17","v":"12:55:25.970"},{"$f":"'SP6'!K17","v":"00:00:00"},{"$f":"'SP6'!L17","v":"00:02:25.970"},{"$f":"'SP6'!M17","v":"00:00:00.970"},{"$f":"'SP6'!S17","v":"Fahrer Klaus Flettner mit der StartNr. 15 ,hat erfolgreich die Prüfung SP6 absolviert. Zeit: "},{"$f":"'SP6'!T17","v":"00:00:00.970"},{"$f":"'SP6'!V17","v":1}]
[{"$f":"'SP6'!I18","v":"12:51:00,00"},{"$f":"'SP6'!J18","v":"12:53:25.230"},{"$f":"'SP6'!K18","v":"00:00:00"},{"$f":"'SP6'!L18","v":"00:02:25.230"},{"$f":"'SP6'!M18","v":"00:00:00.230"},{"$f":"'SP6'!S18","v":"Fahrer Heinz Frey mit der StartNr. 16 ,hat erfolgreich die Prüfung SP6 absolviert. Zeit: "},{"$f":"'SP6'!T18","v":"00:00:00.230"},{"$f":"'SP6'!V18","v":1}]
[{"$f":"'SP6'!I19","v":"13:41:00,00"},{"$f":"'SP6'!J19","v":"13:43:25.470"},{"$f":"'SP6'!K19","v":"00:00:00"},{"$f":"'SP6'!L19","v":"00:02:25.470"},{"$f":"'SP6'!M19","v":"00:00:00.470"},{"$f":"'SP6'!S19","v":"Fahrer Henning Reichel mit der StartNr. 17 ,hat erfolgreich die Prüfung SP6 absolviert. Zeit: "},{"$f":"'SP6'!T19","v":"00:00:00.470"},{"$f":"'SP6'!V19","v":1}]
[{"$f":"'SP6'!I20","v":"13:05:00,00"},{"$f":"'SP6'!J20","v":"13:07:27.810"},{"$f":"'SP6'!K20","v":"00:00:00"},{"$f":"'SP6'!L20","v":"00:02:27.810"},{"$f":"'SP6'!M20","v":"00:00:02.810"},{"$f":"'SP6'!S20","v":"Fahrer Maik Käbisch mit der StartNr. 18 ,hat erfolgreich die Prüfung SP6 absolviert. Zeit: "},{"$f":"'SP6'!T20","v":"00:00:02.810"},{"$f":"'SP6'!V20","v":1}]
[{"$f":"'SP6'!I21","v":"12:40:00"},{"$f":"'SP6'!J21","v":"12:42:25.790"},{"$f":"'SP6'!K21","v":"00:00:00"},{"$f":"'SP6'!L21","v":"00:02:25.790"},{"$f":"'SP6'!M21","v":"00:00:00.790"},{"$f":"'SP6'!S21","v":"Fahrer Harald Zapp mit der StartNr. 19 ,hat erfolgreich die Prüfung SP6 absolviert. Zeit: "},{"$f":"'SP6'!T21","v":"00:00:00.790"},{"$f":"'SP6'!V21","v":1}]
[{"$f":"'SP6'!I22","v":"13:08:00,00"},{"$f":"'SP6'!J22","v":"13:10:25.020"},{"$f":"'SP6'!K22","v":"00:00:00"},{"$f":"'SP6'!L22","v":"00:02:25.020"},{"$f":"'SP6'!M22","v":"00:00:00.020"},{"$f":"'SP6'!S22","v":"Fahrer Reinhard Grzesik mit der StartNr. 20 ,hat erfolgreich die Prüfung SP6 absolviert. Zeit: "},{"$f":"'SP6'!T22","v":"00:00:00.020"},{"$f":"'SP6'!V22","v":1}]
[{"$f":"'SP6'!I23","v":"13:00:00,00"},{"$f":"'SP6'!J23","v":"13:02:26.400"},{"$f":"'SP6'!K23","v":"00:00:00"},{"$f":"'SP6'!L23","v":"00:02:26.400"},{"$f":"'SP6'!M23","v":"00:00:01.400"},{"$f":"'SP6'!S23","v":"Fahrer Jörg Sihler mit der StartNr. 21 ,hat erfolgreich die Prüfung SP6 absolviert. Zeit: "},{"$f":"'SP6'!T23","v":"00:00:01.400"},{"$f":"'SP6'!V23","v":1}]
[{"$f":"'SP6'!I24","v":"13:06:00,00"},{"$f":"'SP6'!J24","v":"13:08:26.030"},{"$f":"'SP6'!K24","v":"00:00:00"},{"$f":"'SP6'!L24","v":"00:02:26.030"},{"$f":"'SP6'!M24","v":"00:00:01.030"},{"$f":"'SP6'!S24","v":"Fahrer Ingo Winterstein mit der StartNr. 22 ,hat erfolgreich die Prüfung SP6 absolviert. Zeit: "},{"$f":"'SP6'!T24","v":"00:00:01.030"},{"$f":"'SP6'!V24","v":1}]
[{"$f":"'SP6'!I25","v":"12:59:00,00"},{"$f":"'SP6'!J25","v":"13:01:27.190"},{"$f":"'SP6'!K25","v":"00:00:00"},{"$f":"'SP6'!L25","v":"00:02:27.190"},{"$f":"'SP6'!M25","v":"00:00:02.190"},{"$f":"'SP6'!S25","v":"Fahrer Hans Werner Melchior mit der StartNr. 23 ,hat erfolgreich die Prüfung SP6 absolviert. Zeit: "},{"$f":"'SP6'!T25","v":"00:00:02.190"},{"$f":"'SP6'!V25","v":1}]
[{"$f":"'SP6'!I26","v":"12:57:00,00"},{"$f":"'SP6'!J26","v":"12:59:24.020"},{"$f":"'SP6'!K26","v":"00:00:00"},{"$f":"'SP6'!L26","v":"00:02:24.020"},{"$f":"'SP6'!M26","v":"00:00:00.980"},{"$f":"'SP6'!S26","v":"Fahrer Marco Oriolo mit der StartNr. 24 ,hat erfolgreich die Prüfung SP6 absolviert. Zeit: -"},{"$f":"'SP6'!T26","v":"00:00:00.980"},{"$f":"'SP6'!V26","v":1}]
[{"$f":"'SP6'!I27","v":"13:01:00,00"},{"$f":"'SP6'!J27","v":"13:03:26.710"},{"$f":"'SP6'!K27","v":"00:00:00"},{"$f":"'SP6'!L27","v":"00:02:26.710"},{"$f":"'SP6'!M27","v":"00:00:01.710"},{"$f":"'SP6'!S27","v":"Fahrer Manfred Stommel mit der StartNr. 25 ,hat erfolgreich die Prüfung SP6 absolviert. Zeit: "},{"$f":"'SP6'!T27","v":"00:00:01.710"},{"$f":"'SP6'!V27","v":1}]
[{"$f":"'SP6'!I28","v":"12:56:00,00"},{"$f":"'SP6'!J28","v":"12:58:25.630"},{"$f":"'SP6'!K28","v":"00:00:00"},{"$f":"'SP6'!L28","v":"00:02:25.630"},{"$f":"'SP6'!M28","v":"00:00:00.630"},{"$f":"'SP6'!S28","v":"Fahrer Carolin Heusel mit der StartNr. 26 ,hat erfolgreich die Prüfung SP6 absolviert. Zeit: "},{"$f":"'SP6'!T28","v":"00:00:00.630"},{"$f":"'SP6'!V28","v":1}]
[{"$f":"'SP6'!I29","v":"13:07:00,00"},{"$f":"'SP6'!J29","v":"13:09:26.080"},{"$f":"'SP6'!K29","v":"00:00:00"},{"$f":"'SP6'!L29","v":"00:02:26.080"},{"$f":"'SP6'!M29","v":"00:00:01.080"},{"$f":"'SP6'!S29","v":"Fahrer Regina Philippi mit der StartNr. 27 ,hat erfolgreich die Prüfung SP6 absolviert. Zeit: "},{"$f":"'SP6'!T29","v":"00:00:01.080"},{"$f":"'SP6'!V29","v":1}]
[{"$f":"'SP6'!I30","v":"13:38:00,00"},{"$f":"'SP6'!J30","v":"13:40:26.350"},{"$f":"'SP6'!K30","v":"00:00:00"},{"$f":"'SP6'!L30","v":"00:02:26.350"},{"$f":"'SP6'!M30","v":"00:00:01.350"},{"$f":"'SP6'!S30","v":"Fahrer Christof Aha mit der StartNr. 28 ,hat erfolgreich die Prüfung SP6 absolviert. Zeit: "},{"$f":"'SP6'!T30","v":"00:00:01.350"},{"$f":"'SP6'!V30","v":1}]
[{"$f":"'SP6'!I31","v":"13:10:00,00"},{"$f":"'SP6'!J31","v":"13:11:33.620"},{"$f":"'SP6'!K31","v":"00:00:00"},{"$f":"'SP6'!L31","v":"00:01:33.620"},{"$f":"'SP6'!M31","v":"00:00:51.380"},{"$f":"'SP6'!S31","v":"Fahrer Dennis Weiss mit der StartNr. 29 ,hat erfolgreich die Prüfung SP6 absolviert. Zeit: -"},{"$f":"'SP6'!T31","v":"00:00:51.380"},{"$f":"'SP6'!V31","v":1}]
[{"$f":"'SP6'!I32","v":"13:09:00,00"},{"$f":"'SP6'!J32","v":"13:11:25.250"},{"$f":"'SP6'!K32","v":"00:00:00"},{"$f":"'SP6'!L32","v":"00:02:25.250"},{"$f":"'SP6'!M32","v":"00:00:00.250"},{"$f":"'SP6'!S32","v":"Fahrer Harald Hamprecht mit der StartNr. 30 ,hat erfolgreich die Prüfung SP6 absolviert. Zeit: "},{"$f":"'SP6'!T32","v":"00:00:00.250"},{"$f":"'SP6'!V32","v":1}]
[{"$f":"'SP6'!I33","v":"13:23:00,00"},{"$f":"'SP6'!J33","v":"13:24:51.070"},{"$f":"'SP6'!K33","v":"00:00:00"},{"$f":"'SP6'!L33","v":"00:01:51.070"},{"$f":"'SP6'!M33","v":"00:00:33.930"},{"$f":"'SP6'!S33","v":"Fahrer Reno Fiolic mit der StartNr. 31 ,hat erfolgreich die Prüfung SP6 absolviert. Zeit: -"},{"$f":"'SP6'!T33","v":"00:00:33.930"},{"$f":"'SP6'!V33","v":1}]
[{"$f":"'SP6'!I34","v":"13:04:00,00"},{"$f":"'SP6'!J34","v":"13:06:25.480"},{"$f":"'SP6'!K34","v":"00:00:00"},{"$f":"'SP6'!L34","v":"00:02:25.480"},{"$f":"'SP6'!M34","v":"00:00:00.480"},{"$f":"'SP6'!S34","v":"Fahrer Jürgen Kulpe mit der StartNr. 32 ,hat erfolgreich die Prüfung SP6 absolviert. Zeit: "},{"$f":"'SP6'!T34","v":"00:00:00.480"},{"$f":"'SP6'!V34","v":1}]
[{"$f":"'SP6'!I35","v":"12:58:00,00"},{"$f":"'SP6'!J35","v":"13:00:25.440"},{"$f":"'SP6'!K35","v":"00:00:00"},{"$f":"'SP6'!L35","v":"00:02:25.440"},{"$f":"'SP6'!M35","v":"00:00:00.440"},{"$f":"'SP6'!S35","v":"Fahrer Konstantin Kovarbasic mit der StartNr. 33 ,hat erfolgreich die Prüfung SP6 absolviert. Zeit: "},{"$f":"'SP6'!T35","v":"00:00:00.440"},{"$f":"'SP6'!V35","v":1}]
[{"$f":"'SP6'!I36","v":"13:20:00,00"},{"$f":"'SP6'!J36","v":"13:22:25.850"},{"$f":"'SP6'!K36","v":"00:00:00"},{"$f":"'SP6'!L36","v":"00:02:25.850"},{"$f":"'SP6'!M36","v":"00:00:00.850"},{"$f":"'SP6'!S36","v":"Fahrer Nikolaus Kratz mit der StartNr. 34 ,hat erfolgreich die Prüfung SP6 absolviert. Zeit: "},{"$f":"'SP6'!T36","v":"00:00:00.850"},{"$f":"'SP6'!V36","v":1}]
[{"$f":"'SP6'!I37","v":"13:31:00,00"},{"$f":"'SP6'!J37","v":"13:33:25.720"},{"$f":"'SP6'!K37","v":"00:00:00"},{"$f":"'SP6'!L37","v":"00:02:25.720"},{"$f":"'SP6'!M37","v":"00:00:00.720"},{"$f":"'SP6'!S37","v":"Fahrer Andreas Eberhardt mit der StartNr. 35 ,hat erfolgreich die Prüfung SP6 absolviert. Zeit: "},{"$f":"'SP6'!T37","v":"00:00:00.720"},{"$f":"'SP6'!V37","v":1}]
[{"$f":"'SP6'!I38","v":"13:02:00"},{"$f":"'SP6'!J38","v":"13:04:28.090"},{"$f":"'SP6'!K38","v":"00:00:00"},{"$f":"'SP6'!L38","v":"00:02:28.090"},{"$f":"'SP6'!M38","v":"00:00:03.090"},{"$f":"'SP6'!S38","v":"Fahrer Gerhard Thomas mit der StartNr. 36 ,hat erfolgreich die Prüfung SP6 absolviert. Zeit: "},{"$f":"'SP6'!T38","v":"00:00:03.090"},{"$f":"'SP6'!V38","v":1}]
[{"$f":"'SP6'!I39","v":"13:29:00,00"},{"$f":"'SP6'!J39","v":"13:31:25.220"},{"$f":"'SP6'!K39","v":"00:00:00"},{"$f":"'SP6'!L39","v":"00:02:25.220"},{"$f":"'SP6'!M39","v":"00:00:00.220"},{"$f":"'SP6'!S39","v":"Fahrer Lotzi Kende mit der StartNr. 37 ,hat erfolgreich die Prüfung SP6 absolviert. Zeit: "},{"$f":"'SP6'!T39","v":"00:00:00.220"},{"$f":"'SP6'!V39","v":1}]
[{"$f":"'SP6'!I40","v":"13:13:00,00"},{"$f":"'SP6'!J40","v":"13:15:25.710"},{"$f":"'SP6'!K40","v":"00:00:00"},{"$f":"'SP6'!L40","v":"00:02:25.710"},{"$f":"'SP6'!M40","v":"00:00:00.710"},{"$f":"'SP6'!S40","v":"Fahrer Jockel Winkelhock mit der StartNr. 38 ,hat erfolgreich die Prüfung SP6 absolviert. Zeit: "},{"$f":"'SP6'!T40","v":"00:00:00.710"},{"$f":"'SP6'!V40","v":1}]
[{"$f":"'SP6'!I41","v":"13:03:00,00"},{"$f":"'SP6'!J41","v":"13:05:25.170"},{"$f":"'SP6'!K41","v":"00:00:00"},{"$f":"'SP6'!L41","v":"00:02:25.170"},{"$f":"'SP6'!M41","v":"00:00:00.170"},{"$f":"'SP6'!S41","v":"Fahrer Sascha Wilkesmann mit der StartNr. 39 ,hat erfolgreich die Prüfung SP6 absolviert. Zeit: "},{"$f":"'SP6'!T41","v":"00:00:00.170"},{"$f":"'SP6'!V41","v":1}]
[{"$f":"'SP6'!I42","v":"14:04:00,00"},{"$f":"'SP6'!J42","v":"14:07:30.810"},{"$f":"'SP6'!K42","v":"00:00:00"},{"$f":"'SP6'!L42","v":"00:03:30.810"},{"$f":"'SP6'!M42","v":"00:01:05.810"},{"$f":"'SP6'!S42","v":"Fahrer Gregor Schulz mit der StartNr. 40 ,hat erfolgreich die Prüfung SP6 absolviert. Zeit: "},{"$f":"'SP6'!T42","v":"00:01:05.810"},{"$f":"'SP6'!V42","v":"x"}]
[{"$f":"'SP6'!I43","v":"13:32:00,00"},{"$f":"'SP6'!J43","v":"13:34:22.260"},{"$f":"'SP6'!K43","v":"00:00:00"},{"$f":"'SP6'!L43","v":"00:02:22.260"},{"$f":"'SP6'!M43","v":"00:00:02.740"},{"$f":"'SP6'!S43","v":"Fahrer Peer Hildmann mit der StartNr. 41 ,hat erfolgreich die Prüfung SP6 absolviert. Zeit: -"},{"$f":"'SP6'!T43","v":"00:00:02.740"},{"$f":"'SP6'!V43","v":1}]
[{"$f":"'SP6'!I44","v":"13:43:00,00"},{"$f":"'SP6'!J44","v":"13:45:27.400"},{"$f":"'SP6'!K44","v":"00:00:00"},{"$f":"'SP6'!L44","v":"00:02:27.400"},{"$f":"'SP6'!M44","v":"00:00:02.400"},{"$f":"'SP6'!S44","v":"Fahrer Mina Tander mit der StartNr. 42 ,hat erfolgreich die Prüfung SP6 absolviert. Zeit: "},{"$f":"'SP6'!T44","v":"00:00:02.400"},{"$f":"'SP6'!V44","v":1}]
[{"$f":"'SP6'!I45","v":""},{"$f":"'SP6'!J45","v":""},{"$f":"'SP6'!K45","v":""},{"$f":"'SP6'!L45","v":""},{"$f":"'SP6'!M45","v":{"$error":"#VALUE!"}},{"$f":"'SP6'!S45","v":""},{"$f":"'SP6'!T45","v":""},{"$f":"'SP6'!V45","v":0}]
[{"$f":"'SP6'!I46","v":"13:12:00,00"},{"$f":"'SP6'!J46","v":"13:13:47.720"},{"$f":"'SP6'!K46","v":"00:00:00"},{"$f":"'SP6'!L46","v":"00:01:47.720"},{"$f":"'SP6'!M46","v":"00:00:37.280"},{"$f":"'SP6'!S46","v":"Fahrer Jean-Philippe Kempf mit der StartNr. 44 ,hat erfolgreich die Prüfung SP6 absolviert. Zeit: -"},{"$f":"'SP6'!T46","v":"00:00:37.280"},{"$f":"'SP6'!V46","v":1}]
[{"$f":"'SP6'!I47","v":"13:15:00,00"},{"$f":"'SP6'!J47","v":"13:17:26.130"},{"$f":"'SP6'!K47","v":"00:00:00"},{"$f":"'SP6'!L47","v":"00:02:26.130"},{"$f":"'SP6'!M47","v":"00:00:01.130"},{"$f":"'SP6'!S47","v":"Fahrer Daniel Martin mit der StartNr. 45 ,hat erfolgreich die Prüfung SP6 absolviert. Zeit: "},{"$f":"'SP6'!T47","v":"00:00:01.130"},{"$f":"'SP6'!V47","v":1}]
[{"$f":"'SP6'!I48","v":"13:35:00,00"},{"$f":"'SP6'!J48","v":"13:37:25.230"},{"$f":"'SP6'!K48","v":"00:00:00"},{"$f":"'SP6'!L48","v":"00:02:25.230"},{"$f":"'SP6'!M48","v":"00:00:00.230"},{"$f":"'SP6'!S48","v":"Fahrer Elena Funk mit der StartNr. 46 ,hat erfolgreich die Prüfung SP6 absolviert. Zeit: "},{"$f":"'SP6'!T48","v":"00:00:00.230"},{"$f":"'SP6'!V48","v":1}]
[{"$f":"'SP6'!I49","v":"13:36:00,00"},{"$f":"'SP6'!J49","v":"13:38:24.470"},{"$f":"'SP6'!K49","v":"00:00:00"},{"$f":"'SP6'!L49","v":"00:02:24.470"},{"$f":"'SP6'!M49","v":"00:00:00.530"},{"$f":"'SP6'!S49","v":"Fahrer Hans Mutschall mit der StartNr. 47 ,hat erfolgreich die Prüfung SP6 absolviert. Zeit: -"},{"$f":"'SP6'!T49","v":"00:00:00.530"},{"$f":"'SP6'!V49","v":1}]
[{"$f":"'SP6'!I50","v":"13:11:00,00"},{"$f":"'SP6'!J50","v":"13:13:25.620"},{"$f":"'SP6'!K50","v":"00:00:00"},{"$f":"'SP6'!L50","v":"00:02:25.620"},{"$f":"'SP6'!M50","v":"00:00:00.620"},{"$f":"'SP6'!S50","v":"Fahrer Kahled Rahman mit der StartNr. 48 ,hat erfolgreich die Prüfung SP6 absolviert. Zeit: "},{"$f":"'SP6'!T50","v":"00:00:00.620"},{"$f":"'SP6'!V50","v":1}]
[{"$f":"'SP6'!I51","v":"13:16:00,00"},{"$f":"'SP6'!J51","v":"13:18:25.220"},{"$f":"'SP6'!K51","v":"00:00:00"},{"$f":"'SP6'!L51","v":"00:02:25.220"},{"$f":"'SP6'!M51","v":"00:00:00.220"},{"$f":"'SP6'!S51","v":"Fahrer Jochen Schwarz mit der StartNr. 49 ,hat erfolgreich die Prüfung SP6 absolviert. Zeit: "},{"$f":"'SP6'!T51","v":"00:00:00.220"},{"$f":"'SP6'!V51","v":1}]
[{"$f":"'SP6'!I52","v":"13:49:00,00"},{"$f":"'SP6'!J52","v":"13:51:33.030"},{"$f":"'SP6'!K52","v":"00:00:00"},{"$f":"'SP6'!L52","v":"00:02:33.030"},{"$f":"'SP6'!M52","v":"00:00:08.030"},{"$f":"'SP6'!S52","v":"Fahrer Axel Nawrath mit der StartNr. 50 ,hat erfolgreich die Prüfung SP6 absolviert. Zeit: "},{"$f":"'SP6'!T52","v":"00:00:08.030"},{"$f":"'SP6'!V52","v":"x"}]
[{"$f":"'SP6'!I53","v":"13:44:00,00"},{"$f":"'SP6'!J53","v":"13:46:29.940"},{"$f":"'SP6'!K53","v":"00:00:00"},{"$f":"'SP6'!L53","v":"00:02:29.940"},{"$f":"'SP6'!M53","v":"00:00:04.940"},{"$f":"'SP6'!S53","v":"Fahrer Birgit Claussen mit der StartNr. 51 ,hat erfolgreich die Prüfung SP6 absolviert. Zeit: "},{"$f":"'SP6'!T53","v":"00:00:04.940"},{"$f":"'SP6'!V53","v":1}]
[{"$f":"'SP6'!I54","v":"13:17:00,00"},{"$f":"'SP6'!J54","v":"13:19:26.550"},{"$f":"'SP6'!K54","v":"00:00:00"},{"$f":"'SP6'!L54","v":"00:02:26.550"},{"$f":"'SP6'!M54","v":"00:00:01.550"},{"$f":"'SP6'!S54","v":"Fahrer Harald König mit der StartNr. 52 ,hat erfolgreich die Prüfung SP6 absolviert. Zeit: "},{"$f":"'SP6'!T54","v":"00:00:01.550"},{"$f":"'SP6'!V54","v":1}]
[{"$f":"'SP6'!I55","v":"13:37:00,00"},{"$f":"'SP6'!J55","v":"13:39:22.550"},{"$f":"'SP6'!K55","v":"00:00:00"},{"$f":"'SP6'!L55","v":"00:02:22.550"},{"$f":"'SP6'!M55","v":"00:00:02.450"},{"$f":"'SP6'!S55","v":"Fahrer Thomas Blank mit der StartNr. 53 ,hat erfolgreich die Prüfung SP6 absolviert. Zeit: -"},{"$f":"'SP6'!T55","v":"00:00:02.450"},{"$f":"'SP6'!V55","v":1}]
[{"$f":"'SP6'!I56","v":"13:39:00,00"},{"$f":"'SP6'!J56","v":"13:41:24.890"},{"$f":"'SP6'!K56","v":"00:00:00"},{"$f":"'SP6'!L56","v":"00:02:24.890"},{"$f":"'SP6'!M56","v":"00:00:00.110"},{"$f":"'SP6'!S56","v":"Fahrer Heidi Eberhardt mit der StartNr. 54 ,hat erfolgreich die Prüfung SP6 absolviert. Zeit: -"},{"$f":"'SP6'!T56","v":"00:00:00.110"},{"$f":"'SP6'!V56","v":1}]
[{"$f":"'SP6'!I57","v":"13:46:00,00"},{"$f":"'SP6'!J57","v":"13:48:25.340"},{"$f":"'SP6'!K57","v":"00:00:00"},{"$f":"'SP6'!L57","v":"00:02:25.340"},{"$f":"'SP6'!M57","v":"00:00:00.340"},{"$f":"'SP6'!S57","v":"Fahrer Karina Ansos mit der StartNr. 55 ,hat erfolgreich die Prüfung SP6 absolviert. Zeit: "},{"$f":"'SP6'!T57","v":"00:00:00.340"},{"$f":"'SP6'!V57","v":1}]
[{"$f":"'SP6'!I58","v":"13:18:00,00"},{"$f":"'SP6'!J58","v":"13:20:27.400"},{"$f":"'SP6'!K58","v":"00:00:00"},{"$f":"'SP6'!L58","v":"00:02:27.400"},{"$f":"'SP6'!M58","v":"00:00:02.400"},{"$f":"'SP6'!S58","v":"Fahrer Michael Gotta mit der StartNr. 56 ,hat erfolgreich die Prüfung SP6 absolviert. Zeit: "},{"$f":"'SP6'!T58","v":"00:00:02.400"},{"$f":"'SP6'!V58","v":1}]
[{"$f":"'SP6'!I59","v":"13:42:00,00"},{"$f":"'SP6'!J59","v":"13:44:24.480"},{"$f":"'SP6'!K59","v":"00:00:00"},{"$f":"'SP6'!L59","v":"00:02:24.480"},{"$f":"'SP6'!M59","v":"00:00:00.520"},{"$f":"'SP6'!S59","v":"Fahrer Stefanie Rinck mit der StartNr. 57 ,hat erfolgreich die Prüfung SP6 absolviert. Zeit: -"},{"$f":"'SP6'!T59","v":"00:00:00.520"},{"$f":"'SP6'!V59","v":1}]
[{"$f":"'SP6'!I60","v":"13:45:00,00"},{"$f":"'SP6'!J60","v":"13:47:21.210"},{"$f":"'SP6'!K60","v":"00:00:00"},{"$f":"'SP6'!L60","v":"00:02:21.210"},{"$f":"'SP6'!M60","v":"00:00:03.790"},{"$f":"'SP6'!S60","v":"Fahrer Armin Slotta mit der StartNr. 58 ,hat erfolgreich die Prüfung SP6 absolviert. Zeit: -"},{"$f":"'SP6'!T60","v":"00:00:03.790"},{"$f":"'SP6'!V60","v":1}]
[{"$f":"'SP6'!I61","v":"13:30:00,00"},{"$f":"'SP6'!J61","v":"13:32:21.080"},{"$f":"'SP6'!K61","v":"00:00:00"},{"$f":"'SP6'!L61","v":"00:02:21.080"},{"$f":"'SP6'!M61","v":"00:00:03.920"},{"$f":"'SP6'!S61","v":"Fahrer Julia Kende mit der StartNr. 59 ,hat erfolgreich die Prüfung SP6 absolviert. Zeit: -"},{"$f":"'SP6'!T61","v":"00:00:03.920"},{"$f":"'SP6'!V61","v":1}]
[{"$f":"'SP6'!I62","v":"13:21:00,00"},{"$f":"'SP6'!J62","v":"13:23:25.170"},{"$f":"'SP6'!K62","v":"00:00:00"},{"$f":"'SP6'!L62","v":"00:02:25.170"},{"$f":"'SP6'!M62","v":"00:00:00.170"},{"$f":"'SP6'!S62","v":"Fahrer Robert Bleckmann mit der StartNr. 60 ,hat erfolgreich die Prüfung SP6 absolviert. Zeit: "},{"$f":"'SP6'!T62","v":"00:00:00.170"},{"$f":"'SP6'!V62","v":1}]
[{"$f":"'SP6'!I63","v":"14:10:00,00"},{"$f":"'SP6'!J63","v":"14:12:25.920"},{"$f":"'SP6'!K63","v":"00:00:00"},{"$f":"'SP6'!L63","v":"00:02:25.920"},{"$f":"'SP6'!M63","v":"00:00:00.920"},{"$f":"'SP6'!S63","v":"Fahrer Christof Harwardt mit der StartNr. 61 ,hat erfolgreich die Prüfung SP6 absolviert. Zeit: "},{"$f":"'SP6'!T63","v":"00:00:00.920"},{"$f":"'SP6'!V63","v":1}]
[{"$f":"'SP6'!I64","v":"13:56:00,00"},{"$f":"'SP6'!J64","v":"13:58:29.850"},{"$f":"'SP6'!K64","v":"00:00:00"},{"$f":"'SP6'!L64","v":"00:02:29.850"},{"$f":"'SP6'!M64","v":"00:00:04.850"},{"$f":"'SP6'!S64","v":"Fahrer Thomas Kahns mit der StartNr. 62 ,hat erfolgreich die Prüfung SP6 absolviert. Zeit: "},{"$f":"'SP6'!T64","v":"00:00:04.850"},{"$f":"'SP6'!V64","v":1}]
[{"$f":"'SP6'!I65","v":"13:14:00,00"},{"$f":"'SP6'!J65","v":"13:16:27.110"},{"$f":"'SP6'!K65","v":"00:00:00"},{"$f":"'SP6'!L65","v":"00:02:27.110"},{"$f":"'SP6'!M65","v":"00:00:02.110"},{"$f":"'SP6'!S65","v":"Fahrer Maximilian Herbst mit der StartNr. 63 ,hat erfolgreich die Prüfung SP6 absolviert. Zeit: "},{"$f":"'SP6'!T65","v":"00:00:02.110"},{"$f":"'SP6'!V65","v":1}]
[{"$f":"'SP6'!I66","v":"13:28:00,00"},{"$f":"'SP6'!J66","v":"13:30:24.820"},{"$f":"'SP6'!K66","v":"00:00:00"},{"$f":"'SP6'!L66","v":"00:02:24.820"},{"$f":"'SP6'!M66","v":"00:00:00.180"},{"$f":"'SP6'!S66","v":"Fahrer Jürgen Buchhold mit der StartNr. 64 ,hat erfolgreich die Prüfung SP6 absolviert. Zeit: -"},{"$f":"'SP6'!T66","v":"00:00:00.180"},{"$f":"'SP6'!V66","v":1}]
[{"$f":"'SP6'!I67","v":""},{"$f":"'SP6'!J67","v":""},{"$f":"'SP6'!K67","v":""},{"$f":"'SP6'!L67","v":""},{"$f":"'SP6'!M67","v":{"$error":"#VALUE!"}},{"$f":"'SP6'!S67","v":""},{"$f":"'SP6'!T67","v":""},{"$f":"'SP6'!V67","v":0}]
[{"$f":"'SP6'!I68","v":"13:33:00,00"},{"$f":"'SP6'!J68","v":"13:35:01.160"},{"$f":"'SP6'!K68","v":"00:00:00"},{"$f":"'SP6'!L68","v":"00:02:01.160"},{"$f":"'SP6'!M68","v":"00:00:23.840"},{"$f":"'SP6'!S68","v":"Fahrer Peter Bel mit der StartNr. 66 ,hat erfolgreich die Prüfung SP6 absolviert. Zeit: -"},{"$f":"'SP6'!T68","v":"00:00:23.840"},{"$f":"'SP6'!V68","v":1}]
[{"$f":"'SP6'!I69","v":"13:40:00,00"},{"$f":"'SP6'!J69","v":"13:42:26.460"},{"$f":"'SP6'!K69","v":"00:00:00"},{"$f":"'SP6'!L69","v":"00:02:26.460"},{"$f":"'SP6'!M69","v":"00:00:01.460"},{"$f":"'SP6'!S69","v":"Fahrer Thomas Mirau mit der StartNr. 67 ,hat erfolgreich die Prüfung SP6 absolviert. Zeit: "},{"$f":"'SP6'!T69","v":"00:00:01.460"},{"$f":"'SP6'!V69","v":1}]
[{"$f":"'SP6'!I70","v":"13:27:00,00"},{"$f":"'SP6'!J70","v":"13:29:26"},{"$f":"'SP6'!K70","v":"00:00:00"},{"$f":"'SP6'!L70","v":"00:02:26"},{"$f":"'SP6'!M70","v":"00:00:01"},{"$f":"'SP6'!S70","v":"Fahrer Markus Gotta mit der StartNr. 68 ,hat erfolgreich die Prüfung SP6 absolviert. Zeit: "},{"$f":"'SP6'!T70","v":"00:00:01"},{"$f":"'SP6'!V70","v":1}]
[{"$f":"'SP6'!I71","v":"13:24:00,00"},{"$f":"'SP6'!J71","v":"13:26:26.130"},{"$f":"'SP6'!K71","v":"00:00:00"},{"$f":"'SP6'!L71","v":"00:02:26.130"},{"$f":"'SP6'!M71","v":"00:00:01.130"},{"$f":"'SP6'!S71","v":"Fahrer Robin Keulertz mit der StartNr. 69 ,hat erfolgreich die Prüfung SP6 absolviert. Zeit: "},{"$f":"'SP6'!T71","v":"00:00:01.130"},{"$f":"'SP6'!V71","v":1}]
[{"$f":"'SP6'!I72","v":"13:51:00,00"},{"$f":"'SP6'!J72","v":"13:53:25.750"},{"$f":"'SP6'!K72","v":"00:00:00"},{"$f":"'SP6'!L72","v":"00:02:25.750"},{"$f":"'SP6'!M72","v":"00:00:00.750"},{"$f":"'SP6'!S72","v":"Fahrer Christian Häp mit der StartNr. 70 ,hat erfolgreich die Prüfung SP6 absolviert. Zeit: "},{"$f":"'SP6'!T72","v":"00:00:00.750"},{"$f":"'SP6'!V72","v":1}]
[{"$f":"'SP6'!I73","v":"13:22:00,00"},{"$f":"'SP6'!J73","v":"13:24:25.540"},{"$f":"'SP6'!K73","v":"00:00:00"},{"$f":"'SP6'!L73","v":"00:02:25.540"},{"$f":"'SP6'!M73","v":"00:00:00.540"},{"$f":"'SP6'!S73","v":"Fahrer Ingolf Zschockelt mit der StartNr. 71 ,hat erfolgreich die Prüfung SP6 absolviert. Zeit: "},{"$f":"'SP6'!T73","v":"00:00:00.540"},{"$f":"'SP6'!V73","v":1}]
[{"$f":"'SP6'!I74","v":"13:53:00,00"},{"$f":"'SP6'!J74","v":"13:55:25.790"},{"$f":"'SP6'!K74","v":"00:00:00"},{"$f":"'SP6'!L74","v":"00:02:25.790"},{"$f":"'SP6'!M74","v":"00:00:00.790"},{"$f":"'SP6'!S74","v":"Fahrer Michael Barsties mit der StartNr. 72 ,hat erfolgreich die Prüfung SP6 absolviert. Zeit: "},{"$f":"'SP6'!T74","v":"00:00:00.790"},{"$f":"'SP6'!V74","v":1}]
[{"$f":"'SP6'!I75","v":"13:52:00,00"},{"$f":"'SP6'!J75","v":"13:53:55.570"},{"$f":"'SP6'!K75","v":"00:00:00"},{"$f":"'SP6'!L75","v":"00:01:55.570"},{"$f":"'SP6'!M75","v":"00:00:29.430"},{"$f":"'SP6'!S75","v":"Fahrer Ramona Wagner mit der StartNr. 73 ,hat erfolgreich die Prüfung SP6 absolviert. Zeit: -"},{"$f":"'SP6'!T75","v":"00:00:29.430"},{"$f":"'SP6'!V75","v":1}]
[{"$f":"'SP6'!I76","v":"13:59:00,00"},{"$f":"'SP6'!J76","v":"14:01:25.170"},{"$f":"'SP6'!K76","v":"00:00:00"},{"$f":"'SP6'!L76","v":"00:02:25.170"},{"$f":"'SP6'!M76","v":"00:00:00.170"},{"$f":"'SP6'!S76","v":"Fahrer Lars Fahrenbach mit der StartNr. 74 ,hat erfolgreich die Prüfung SP6 absolviert. Zeit: "},{"$f":"'SP6'!T76","v":"00:00:00.170"},{"$f":"'SP6'!V76","v":1}]
[{"$f":"'SP6'!I77","v":"13:50:00,00"},{"$f":"'SP6'!J77","v":"13:52:25.140"},{"$f":"'SP6'!K77","v":"00:00:00"},{"$f":"'SP6'!L77","v":"00:02:25.140"},{"$f":"'SP6'!M77","v":"00:00:00.140"},{"$f":"'SP6'!S77","v":"Fahrer Frank Hoefnagels mit der StartNr. 75 ,hat erfolgreich die Prüfung SP6 absolviert. Zeit: "},{"$f":"'SP6'!T77","v":"00:00:00.140"},{"$f":"'SP6'!V77","v":1}]
[{"$f":"'SP6'!I78","v":"13:47:00,00"},{"$f":"'SP6'!J78","v":"13:49:24.530"},{"$f":"'SP6'!K78","v":"00:00:00"},{"$f":"'SP6'!L78","v":"00:02:24.530"},{"$f":"'SP6'!M78","v":"00:00:00.470"},{"$f":"'SP6'!S78","v":"Fahrer Michael Karch mit der StartNr. 76 ,hat erfolgreich die Prüfung SP6 absolviert. Zeit: -"},{"$f":"'SP6'!T78","v":"00:00:00.470"},{"$f":"'SP6'!V78","v":1}]
[{"$f":"'SP6'!I79","v":"13:25:00,00"},{"$f":"'SP6'!J79","v":"13:27:19.660"},{"$f":"'SP6'!K79","v":"00:00:00"},{"$f":"'SP6'!L79","v":"00:02:19.660"},{"$f":"'SP6'!M79","v":"00:00:05.340"},{"$f":"'SP6'!S79","v":"Fahrer Dirk Götze mit der StartNr. 77 ,hat erfolgreich die Prüfung SP6 absolviert. Zeit: -"},{"$f":"'SP6'!T79","v":"00:00:05.340"},{"$f":"'SP6'!V79","v":1}]
[{"$f":"'SP6'!I80","v":"13:26:00,00"},{"$f":"'SP6'!J80","v":"13:27:36.760"},{"$f":"'SP6'!K80","v":"00:00:00"},{"$f":"'SP6'!L80","v":"00:01:36.760"},{"$f":"'SP6'!M80","v":"00:00:48.240"},{"$f":"'SP6'!S80","v":"Fahrer Stefan Hillers mit der StartNr. 78 ,hat erfolgreich die Prüfung SP6 absolviert. Zeit: -"},{"$f":"'SP6'!T80","v":"00:00:48.240"},{"$f":"'SP6'!V80","v":1}]
[{"$f":"'SP6'!I81","v":"14:14:00,00"},{"$f":"'SP6'!J81","v":"14:16:25.020"},{"$f":"'SP6'!K81","v":"00:00:00"},{"$f":"'SP6'!L81","v":"00:02:25.020"},{"$f":"'SP6'!M81","v":"00:00:00.020"},{"$f":"'SP6'!S81","v":"Fahrer Christian Rafflenbeul mit der StartNr. 79 ,hat erfolgreich die Prüfung SP6 absolviert. Zeit: "},{"$f":"'SP6'!T81","v":"00:00:00.020"},{"$f":"'SP6'!V81","v":1}]
[{"$f":"'SP6'!I82","v":"14:15:00,00"},{"$f":"'SP6'!J82","v":"14:16:39.900"},{"$f":"'SP6'!K82","v":"00:00:00"},{"$f":"'SP6'!L82","v":"00:01:39.900"},{"$f":"'SP6'!M82","v":"00:00:45.100"},{"$f":"'SP6'!S82","v":"Fahrer Gerhard Reuschel mit der StartNr. 80 ,hat erfolgreich die Prüfung SP6 absolviert. Zeit: -"},{"$f":"'SP6'!T82","v":"00:00:45.100"},{"$f":"'SP6'!V82","v":1}]
[{"$f":"'SP6'!I83","v":"13:48:00,00"},{"$f":"'SP6'!J83","v":"13:50:25.910"},{"$f":"'SP6'!K83","v":"00:00:00"},{"$f":"'SP6'!L83","v":"00:02:25.910"},{"$f":"'SP6'!M83","v":"00:00:00.910"},{"$f":"'SP6'!S83","v":"Fahrer Karsten Rachow mit der StartNr. 81 ,hat erfolgreich die Prüfung SP6 absolviert. Zeit: "},{"$f":"'SP6'!T83","v":"00:00:00.910"},{"$f":"'SP6'!V83","v":1}]
[{"$f":"'SP6'!I84","v":""},{"$f":"'SP6'!J84","v":""},{"$f":"'SP6'!K84","v":""},{"$f":"'SP6'!L84","v":""},{"$f":"'SP6'!M84","v":{"$error":"#VALUE!"}},{"$f":"'SP6'!S84","v":""},{"$f":"'SP6'!T84","v":""},{"$f":"'SP6'!V84","v":0}]
[{"$f":"'SP6'!I85","v":"13:55:00,00"},{"$f":"'SP6'!J85","v":"13:57:27.430"},{"$f":"'SP6'!K85","v":"00:00:00"},{"$f":"'SP6'!L85","v":"00:02:27.430"},{"$f":"'SP6'!M85","v":"00:00:02.430"},{"$f":"'SP6'!S85","v":"Fahrer Alexander Weil mit der StartNr. 83 ,hat erfolgreich die Prüfung SP6 absolviert. Zeit: "},{"$f":"'SP6'!T85","v":"00:00:02.430"},{"$f":"'SP6'!V85","v":1}]
[{"$f":"'SP6'!I86","v":"14:18:00,00"},{"$f":"'SP6'!J86","v":"14:20:27.180"},{"$f":"'SP6'!K86","v":"00:00:00"},{"$f":"'SP6'!L86","v":"00:02:27.180"},{"$f":"'SP6'!M86","v":"00:00:02.180"},{"$f":"'SP6'!S86","v":"Fahrer Josef Lindenberger mit der StartNr. 84 ,hat erfolgreich die Prüfung SP6 absolviert. Zeit: "},{"$f":"'SP6'!T86","v":"00:00:02.180"},{"$f":"'SP6'!V86","v":1}]
[{"$f":"'SP6'!I87","v":"14:12:00,00"},{"$f":"'SP6'!J87","v":"14:13:42.550"},{"$f":"'SP6'!K87","v":"00:00:00"},{"$f":"'SP6'!L87","v":"00:01:42.550"},{"$f":"'SP6'!M87","v":"00:00:42.450"},{"$f":"'SP6'!S87","v":"Fahrer Rick Durante mit der StartNr. 85 ,hat erfolgreich die Prüfung SP6 absolviert. Zeit: -"},{"$f":"'SP6'!T87","v":"00:00:42.450"},{"$f":"'SP6'!V87","v":1}]
[{"$f":"'SP6'!I88","v":"14:11:00,00"},{"$f":"'SP6'!J88","v":"14:13:25.100"},{"$f":"'SP6'!K88","v":"00:00:00"},{"$f":"'SP6'!L88","v":"00:02:25.100"},{"$f":"'SP6'!M88","v":"00:00:00.100"},{"$f":"'SP6'!S88","v":"Fahrer Almuth Siemann mit der StartNr. 86 ,hat erfolgreich die Prüfung SP6 absolviert. Zeit: "},{"$f":"'SP6'!T88","v":"00:00:00.100"},{"$f":"'SP6'!V88","v":1}]
[{"$f":"'SP6'!I89","v":"13:54:00,00"},{"$f":"'SP6'!J89","v":"13:56:45.740"},{"$f":"'SP6'!K89","v":"00:00:00"},{"$f":"'SP6'!L89","v":"00:02:45.740"},{"$f":"'SP6'!M89","v":"00:00:20.740"},{"$f":"'SP6'!S89","v":"Fahrer Axel Strigl mit der StartNr. 87 ,hat erfolgreich die Prüfung SP6 absolviert. Zeit: "},{"$f":"'SP6'!T89","v":"00:00:20.740"},{"$f":"'SP6'!V89","v":1}]
[{"$f":"'SP6'!I90","v":"12:55:00,00"},{"$f":"'SP6'!J90","v":"12:57:25.380"},{"$f":"'SP6'!K90","v":"00:00:00"},{"$f":"'SP6'!L90","v":"00:02:25.380"},{"$f":"'SP6'!M90","v":"00:00:00.380"},{"$f":"'SP6'!S90","v":"Fahrer Philip Sommer mit der StartNr. 88 ,hat erfolgreich die Prüfung SP6 absolviert. Zeit: "},{"$f":"'SP6'!T90","v":"00:00:00.380"},{"$f":"'SP6'!V90","v":1}]
[{"$f":"'SP6'!I91","v":"14:16:00,00"},{"$f":"'SP6'!J91","v":"14:18:24.290"},{"$f":"'SP6'!K91","v":"00:00:00"},{"$f":"'SP6'!L91","v":"00:02:24.290"},{"$f":"'SP6'!M91","v":"00:00:00.710"},{"$f":"'SP6'!S91","v":"Fahrer Jörg Diehl mit der StartNr. 89 ,hat erfolgreich die Prüfung SP6 absolviert. Zeit: -"},{"$f":"'SP6'!T91","v":"00:00:00.710"},{"$f":"'SP6'!V91","v":1}]
[{"$f":"'SP6'!I92","v":"14:09:00,00"},{"$f":"'SP6'!J92","v":"14:11:22.180"},{"$f":"'SP6'!K92","v":"00:00:00"},{"$f":"'SP6'!L92","v":"00:02:22.180"},{"$f":"'SP6'!M92","v":"00:00:02.820"},{"$f":"'SP6'!S92","v":"Fahrer Matthias Herzig mit der StartNr. 90 ,hat erfolgreich die Prüfung SP6 absolviert. Zeit: -"},{"$f":"'SP6'!T92","v":"00:00:02.820"},{"$f":"'SP6'!V92","v":1}]
[{"$f":"'SP6'!I93","v":"13:57:00,00"},{"$f":"'SP6'!J93","v":"13:59:23"},{"$f":"'SP6'!K93","v":"00:00:00"},{"$f":"'SP6'!L93","v":"00:02:23"},{"$f":"'SP6'!M93","v":"00:00:02"},{"$f":"'SP6'!S93","v":"Fahrer Christoph Pasternak mit der StartNr. 91 ,hat erfolgreich die Prüfung SP6 absolviert. Zeit: -"},{"$f":"'SP6'!T93","v":"00:00:02"},{"$f":"'SP6'!V93","v":1}]
[{"$f":"'SP6'!I94","v":"14:08:00,00"},{"$f":"'SP6'!J94","v":"14:10:25.570"},{"$f":"'SP6'!K94","v":"00:00:00"},{"$f":"'SP6'!L94","v":"00:02:25.570"},{"$f":"'SP6'!M94","v":"00:00:00.570"},{"$f":"'SP6'!S94","v":"Fahrer Lothar Schupet mit der StartNr. 92 ,hat erfolgreich die Prüfung SP6 absolviert. Zeit: "},{"$f":"'SP6'!T94","v":"00:00:00.570"},{"$f":"'SP6'!V94","v":1}]
[{"$f":"'SP6'!I95","v":"13:58:00,00"},{"$f":"'SP6'!J95","v":"14:00:30.240"},{"$f":"'SP6'!K95","v":"00:00:00"},{"$f":"'SP6'!L95","v":"00:02:30.240"},{"$f":"'SP6'!M95","v":"00:00:05.240"},{"$f":"'SP6'!S95","v":"Fahrer Wolfgang Schertler mit der StartNr. 93 ,hat erfolgreich die Prüfung SP6 absolviert. Zeit: "},{"$f":"'SP6'!T95","v":"00:00:05.240"},{"$f":"'SP6'!V95","v":1}]
[{"$f":"'SP6'!I96","v":"14:07:00,00"},{"$f":"'SP6'!J96","v":"14:09:25.800"},{"$f":"'SP6'!K96","v":"00:00:00"},{"$f":"'SP6'!L96","v":"00:02:25.800"},{"$f":"'SP6'!M96","v":"00:00:00.800"},{"$f":"'SP6'!S96","v":"Fahrer Thomas Katzensteiner mit der StartNr. 94 ,hat erfolgreich die Prüfung SP6 absolviert. Zeit: "},{"$f":"'SP6'!T96","v":"00:00:00.800"},{"$f":"'SP6'!V96","v":1}]
[{"$f":"'SP6'!I97","v":"14:00:00,00"},{"$f":"'SP6'!J97","v":"14:02:25.990"},{"$f":"'SP6'!K97","v":"00:00:00"},{"$f":"'SP6'!L97","v":"00:02:25.990"},{"$f":"'SP6'!M97","v":"00:00:00.990"},{"$f":"'SP6'!S97","v":"Fahrer Hagen Hackenberg mit der StartNr. 95 ,hat erfolgreich die Prüfung SP6 absolviert. Zeit: "},{"$f":"'SP6'!T97","v":"00:00:00.990"},{"$f":"'SP6'!V97","v":1}]
[{"$f":"'SP6'!I98","v":"14:17:00,00"},{"$f":"'SP6'!J98","v":"14:19:28.060"},{"$f":"'SP6'!K98","v":"00:00:00"},{"$f":"'SP6'!L98","v":"00:02:28.060"},{"$f":"'SP6'!M98","v":"00:00:03.060"},{"$f":"'SP6'!S98","v":"Fahrer Oliver Dietz mit der StartNr. 96 ,hat erfolgreich die Prüfung SP6 absolviert. Zeit: "},{"$f":"'SP6'!T98","v":"00:00:03.060"},{"$f":"'SP6'!V98","v":1}]
[{"$f":"'SP6'!I99","v":"14:03:00,00"},{"$f":"'SP6'!J99","v":"14:05:29.750"},{"$f":"'SP6'!K99","v":"00:00:00"},{"$f":"'SP6'!L99","v":"00:02:29.750"},{"$f":"'SP6'!M99","v":"00:00:04.750"},{"$f":"'SP6'!S99","v":"Fahrer Horst Kempf mit der StartNr. 97 ,hat erfolgreich die Prüfung SP6 absolviert. Zeit: "},{"$f":"'SP6'!T99","v":"00:00:04.750"},{"$f":"'SP6'!V99","v":1}]
[{"$f":"'SP6'!I100","v":"14:02:00,00"},{"$f":"'SP6'!J100","v":"14:04:24.730"},{"$f":"'SP6'!K100","v":"00:00:00"},{"$f":"'SP6'!L100","v":"00:02:24.730"},{"$f":"'SP6'!M100","v":"00:00:00.270"},{"$f":"'SP6'!S100","v":"Fahrer Detlev Pauer mit der StartNr. 98 ,hat erfolgreich die Prüfung SP6 absolviert. Zeit: -"},{"$f":"'SP6'!T100","v":"00:00:00.270"},{"$f":"'SP6'!V100","v":1}]
[{"$f":"'SP6'!I101","v":"14:01:00,00"},{"$f":"'SP6'!J101","v":"14:03:26.140"},{"$f":"'SP6'!K101","v":"00:00:00"},{"$f":"'SP6'!L101","v":"00:02:26.140"},{"$f":"'SP6'!M101","v":"00:00:01.140"},{"$f":"'SP6'!S101","v":"Fahrer Dirk Velte mit der StartNr. 99 ,hat erfolgreich die Prüfung SP6 absolviert. Zeit: "},{"$f":"'SP6'!T101","v":"00:00:01.140"},{"$f":"'SP6'!V101","v":1}]
[{"$f":"'SP6'!I102","v":"14:05:00,00"},{"$f":"'SP6'!J102","v":"14:07:33.180"},{"$f":"'SP6'!K102","v":"00:00:00"},{"$f":"'SP6'!L102","v":"00:02:33.180"},{"$f":"'SP6'!M102","v":"00:00:08.180"},{"$f":"'SP6'!S102","v":"Fahrer Thorsten Krack mit der StartNr. 100 ,hat erfolgreich die Prüfung SP6 absolviert. Zeit: "},{"$f":"'SP6'!T102","v":"00:00:08.180"},{"$f":"'SP6'!V102","v":1}]
[{"$f":"'SP6'!I103","v":"14:06:00,00"},{"$f":"'SP6'!J103","v":"14:08:22.630"},{"$f":"'SP6'!K103","v":"00:00:00"},{"$f":"'SP6'!L103","v":"00:02:22.630"},{"$f":"'SP6'!M103","v":"00:00:02.370"},{"$f":"'SP6'!S103","v":"Fahrer Christian Wittek mit der StartNr. 101 ,hat erfolgreich die Prüfung SP6 absolviert. Zeit: -"},{"$f":"'SP6'!T103","v":"00:00:02.370"},{"$f":"'SP6'!V103","v":1}]
[{"$f":"'SP6'!I104","v":"14:13:00,00"},{"$f":"'SP6'!J104","v":"14:15:26.720"},{"$f":"'SP6'!K104","v":"00:00:00"},{"$f":"'SP6'!L104","v":"00:02:26.720"},{"$f":"'SP6'!M104","v":"00:00:01.720"},{"$f":"'SP6'!S104","v":"Fahrer Benjamin Hix mit der StartNr. 102 ,hat erfolgreich die Prüfung SP6 absolviert. Zeit: "},{"$f":"'SP6'!T104","v":"00:00:01.720"},{"$f":"'SP6'!V104","v":1}]